program: Gaussian 09
title: 000255230
version: EM64L-G09RevD.01
frameworkgroup: C1[X(C17H18O3)]
method: RPBEPBE
basis: SDD
operation: Freq
keyword: #pfreq=noraman
keyword: PBEPBE/SDD
title: #p freq=noraman PBEPBE/SDD
converged: YES YES NO NO
title: Mulliken charges:
elementType: O O O C C C C C C C C C C C C C C C C C H H H H H H H H H H H H H H H H H H
charge: -0.453195 -0.252592 -0.237258 -0.241404 -0.463605 -0.558484 0.342624 0.304868 -0.536275 -0.575527 0.273939 0.150149 -0.470993 0.412878 -0.537828 -0.419725 -0.339974 -0.217907 -0.228086 -0.241353 0.208386 0.236837 0.205599 0.224080 0.223246 0.282630 0.254165 0.336868 0.216186 0.247369 0.244690 0.218710 0.217169 0.231777 0.263566 0.225304 0.226091 0.227075
chargesum: 0.00000
title: Mulliken charges with hydrogens summed into heavy atoms:
elementType: O O O C C C C C C C C C C C C C C C C C
charge: -0.116327 -0.252592 -0.237258 -0.033018 -0.021169 -0.111158 0.342624 0.304868 -0.253644 -0.321363 0.273939 0.150149 -0.007438 0.412878 0.142741 -0.187948 -0.076409 0.007397 -0.001994 -0.014278
polarizability: 2.09294860e+02 1.43088635e+01 2.17184717e+02 6.14692472e+00 5.24302355e+00 1.46063129e+02
1716.lowfreq: -5.7292 -1.3897 0.0003 0.0005 0.0007 5.0734 20.7287 26.6589 31.5235
frequency: 20.7029 26.4221 31.3224 61.1514 92.5518 119.4101 130.6598 140.0784 170.8937 197.9995 209.0371 215.9297 252.5222 265.6022 276.4579 315.1275 357.5073 401.9148 402.6575 416.5965 446.9663 452.4792 465.1198 469.4362 501.8374 573.6412 590.2823 615.1287 630.7529 643.9035 702.2693 709.2460 723.1954 741.8083 748.8077 795.4699 801.5698 836.8884 857.0095 858.6395 871.5024 913.0926 923.7591 944.6301 971.3660 979.4861 983.4839 988.9756 996.5310 1014.9891 1023.7303 1026.5006 1043.4761 1069.9730 1084.3093 1113.8290 1141.2190 1155.2270 1158.0085 1165.7517 1171.6443 1179.6969 1185.2690 1198.9460 1203.7814 1237.6171 1249.9696 1263.9389 1275.2872 1283.5006 1306.2315 1317.1664 1345.5221 1366.3101 1386.5717 1394.8005 1416.8169 1440.5976 1444.4405 1462.3744 1466.3007 1467.1177 1471.7093 1473.5314 1483.6651 1499.4559 1595.5038 1604.4613 1614.4153 1617.0066 2918.1852 2952.3280 2971.9435 2976.2171 3006.3317 3035.3121 3037.6807 3051.2798 3074.4669 3111.7941 3121.5809 3125.6983 3138.2365 3150.8963 3151.5402 3163.9302 3172.3448 3557.8374
redmass: 4.1871 4.4183 4.8901 3.9584 3.6788 4.5086 2.8134 4.7041 3.8914 3.1915 5.5791 1.6330 1.1075 3.2052 2.0482 2.5956 4.0985 3.5917 3.0786 4.4733 4.4942 3.3602 3.8306 4.4738 5.2700 4.6906 3.4401 6.2123 4.1576 3.6264 2.4448 4.1316 3.8505 2.0458 2.3562 3.8651 3.5170 1.5435 1.2544 1.4508 1.7464 1.3518 2.9315 3.7622 3.5464 1.5815 3.2005 6.2298 1.3853 1.9638 3.1534 2.1702 2.1709 4.3212 1.5591 1.2617 1.4127 1.9658 1.4454 1.3906 1.0568 1.4280 1.1460 1.5879 2.3141 1.2935 1.2459 1.2837 1.6882 1.4559 1.6053 1.8752 1.4261 1.7717 5.9851 6.9327 3.2784 2.0376 1.4458 1.1134 1.0500 1.1661 1.0894 1.0971 2.0987 2.9714 6.1865 9.5099 6.4576 6.6813 1.0835 1.0333 1.0640 1.0632 1.0614 1.0962 1.1035 1.0994 1.1051 1.0875 1.0988 1.0862 1.0916 1.0955 1.0903 1.1013 1.0913 1.0662
irintensity: 0.5870 0.7490 0.2373 0.9912 9.8946 1.8495 1.0685 0.1648 3.4306 0.1532 3.1713 4.0601 128.7320 2.5829 4.1199 6.6649 5.2955 1.8960 2.4254 4.7487 2.4848 2.3064 22.4084 1.2541 10.4553 9.0139 0.5432 0.6142 4.3704 5.7956 32.0965 4.7282 4.1364 51.1868 20.0196 11.9139 23.5266 2.2044 3.0614 55.5940 1.2805 8.8393 33.0678 18.9487 10.4470 1.7779 15.4549 0.1846 4.0753 2.1949 47.1481 9.0958 27.6694 191.2071 6.7827 0.1759 4.1623 56.7005 36.1958 35.6933 0.3667 48.5402 1.5506 76.2622 21.6910 27.7826 2.8023 4.1434 67.2415 21.3166 37.5384 61.1656 7.4404 57.9178 6.2837 15.8229 43.7960 12.7207 15.2322 6.4266 12.3252 25.4600 48.4979 10.6513 11.3687 113.4492 1.1016 7.1733 27.2544 25.4099 56.0511 75.7173 53.7573 38.6956 45.0924 35.6338 53.2580 13.8432 47.4139 8.5426 24.9811 0.6182 20.8751 28.6686 11.4790 22.5584 5.5772 2.8075
temp: 298.150 k
press: 1.00000 atm
elementType: 8 8 8 6 6 6 6 6 6 6 6 6 6 6 6 6 6 6 6 6 1 1 1 1 1 1 1 1 1 1 1 1 1 1 1 1 1 1
symmnumber: 1
zpe: 807360.2 jmol-1
zpe.correction: 0.307507 hartree
zpe.thermalcorrener: 0.325774 hartree
zpe.thermalcorrenthalpy: 0.326718 hartree
zpe.thermalcorrgfe: 0.259424 hartree
zpe.sumelectzpe: -882.789225 hartree
zpe.sumelectthermal: -882.770959 hartree
zpe.sumelectthermalent: -882.770014 hartree
zpe.sumelectthermalfe: -882.837308 hartree
dipole: 1.3052 -1.3615 1.9070
dipole: 2.6821
quadrupole: -103.6205 -101.3482 -115.1184
quadrupole: 7.1018 4.7966 0.9919
quadrupole: 3.0752 5.3475 -8.4227 7.1018 4.7966 0.9919
hfenergy: -883.0967323 hartree
pointgroup: C01 [X(C17H18O3)]
dipole: -0.5631681 -0.4182373 0.7883086 debye
polarizability: 198.1576708|12.5569394|191.8907697|-3.0268343|39.5072695|182.4942652 unknown
InChI: InChI=1S/C17H18O3/c1-19-16-9-13-7-8-15(18)14(13)10-17(16)20-11-12-5-3-2-4-6-12/h2-6,9-10,15,18H,7-8,11H2,1H3
charge 0 multiplicity 1
38 atoms
O  -2.748865 2.122605 1.468617
O  1.129609 0.0359 -1.670331
O  -0.00305 -2.181018 -2.517232
C  -2.734999 0.654872 1.628871
C  -4.134748 -0.014012 1.464872
C  -3.859652 -1.393034 0.783975
C  -1.92279 0.020781 0.516989
C  -2.550722 -1.146434 0.042085
C  -0.686505 0.451887 -0.005172
C  -1.940486 -1.920657 -0.968164
C  -0.075332 -0.302009 -1.02919
C  -0.701508 -1.50209 -1.507571
C  1.787582 1.294031 -1.282929
C  2.52493 1.214397 0.048521
C  -0.614727 -3.400496 -3.043549
C  2.657783 2.368527 0.858563
C  3.128214 0.002152 0.465799
C  3.392966 2.317425 2.065051
C  3.855232 -0.052037 1.675332
C  3.993923 1.105757 2.476937
H  -2.295435 0.404633 2.621821
H  -4.719762 0.627442 0.779655
H  -4.688148 -0.106074 2.416867
H  -4.684399 -1.707136 0.118094
H  -3.736691 -2.190153 1.545235
H  -0.225022 1.362275 0.384472
H  -2.427502 -2.82903 -1.336084
H  -3.137854 2.529542 2.283869
H  1.059106 2.129953 -1.285642
H  2.501443 1.457146 -2.11022
H  0.085663 -3.763402 -3.810184
H  -1.599736 -3.192343 -3.506375
H  -0.733834 -4.16803 -2.25303
H  2.183956 3.3093 0.549549
H  3.011134 -0.891522 -0.157036
H  3.489571 3.216781 2.683876
H  4.313847 -0.995582 1.992476
H  4.560405 1.062954 3.414085
