program: Gaussian 09
title: 000255226
version: EM64L-G09RevD.01
frameworkgroup: C1[X(C19H22N2O2)]
method: RPBEPBE
basis: SDD
operation: Freq
keyword: #p
keyword: freq=noraman
keyword: PBEPBE/SDD
title: #p freq=noraman PBEPBE/SDD
converged: YES YES NO NO
title: Mulliken charges:
elementType: O O N N C C C C C C C C C C C C C C C C C C C H H H H H H H H H H H H H H H H H H H H H H
charge: -0.424047 -0.298666 -0.441223 -0.403820 -0.261638 -0.141798 -0.622573 0.213593 0.266071 -0.423384 -0.417881 0.466414 -0.231261 -0.221646 -0.371853 -0.462962 0.278962 -0.389758 -0.332911 -0.015389 0.160542 -0.713046 -0.673581 0.274439 0.270865 0.240917 0.255954 0.303452 0.257723 0.247123 0.338834 0.231611 0.230763 0.267834 0.216705 0.272082 0.206390 0.244809 0.290537 0.222165 0.197926 0.232377 0.259005 0.206532 0.193812
chargesum: 0.00000
title: Mulliken charges with hydrogens summed into heavy atoms:
elementType: O O N N C C C C C C C C C C C C C C C C C C C
charge: -0.085213 -0.298666 -0.137771 -0.113283 0.012801 0.129067 -0.125702 0.213593 0.266071 -0.165661 -0.170758 0.466414 0.000350 0.009117 -0.104020 -0.246256 0.278962 -0.117676 -0.126521 0.229420 0.160542 -0.060577 -0.014232
polarizability: 3.72910664e+02 1.64485436e+01 1.95259400e+02 6.01243684e+00 1.52365348e-01 1.56369607e+02
1716.lowfreq: -17.0373 -4.5678 -2.7201 -0.0007 0.0006 0.0014 9.5552 17.9206 34.4674
frequency: -1.5157 17.7118 34.4014 44.0632 53.2044 67.9207 71.4769 91.3168 107.0542 136.9531 164.4039 192.6027 202.6898 225.5433 245.7069 258.6347 276.3369 300.2186 315.8390 344.4836 350.2158 381.8168 392.0952 407.1680 413.9022 424.2350 448.2826 452.8341 475.5805 500.7109 509.5640 525.5094 539.9741 574.9855 593.4845 636.6707 645.6969 685.0068 699.9593 720.8942 752.8488 761.3141 801.6773 809.6828 815.7403 830.2835 837.9378 847.6874 855.0821 876.9227 883.8574 915.7580 923.1794 934.2643 938.5262 951.7396 953.4447 987.9873 993.0670 998.9850 1007.7582 1022.1055 1038.1454 1080.4082 1100.6972 1108.1517 1131.2304 1136.2637 1140.6272 1158.8343 1164.0575 1171.4122 1177.6436 1184.8808 1197.9010 1219.7472 1241.6190 1262.9425 1269.7535 1280.7130 1290.8685 1312.8462 1313.6230 1314.8161 1333.3180 1354.2090 1365.4173 1371.0825 1371.4381 1388.9823 1390.8422 1430.9201 1446.8350 1449.1401 1456.5610 1465.3287 1467.0618 1467.5863 1473.2776 1482.4562 1486.0126 1523.9757 1556.9807 1591.9685 1594.3275 1617.0133 1628.6089 2970.6893 2977.4710 2979.7388 2993.2740 3025.5619 3060.5164 3063.7516 3076.3440 3089.0986 3097.1972 3103.7874 3105.4416 3124.7860 3130.0685 3131.9850 3144.0604 3144.8242 3163.2889 3163.6524 3535.7003 3549.9398 3557.9282
redmass: 3.0565 4.6483 4.9058 4.9585 3.9461 4.0096 4.6599 4.4055 5.1104 4.9804 3.4942 1.6481 1.5543 3.2863 1.4224 3.8371 3.7997 4.1030 3.9095 1.2933 2.4805 2.9833 1.1481 2.8506 2.8776 2.8400 3.6937 3.2821 2.7589 1.8503 2.4240 2.2993 5.4598 4.4699 6.1783 6.7021 5.6345 3.9095 4.8766 3.1690 4.5169 1.3589 3.5912 1.6695 4.1521 3.6885 2.9600 1.6389 2.8989 1.6431 2.3658 1.2415 2.4848 1.4372 1.4888 1.4714 1.9098 1.3605 1.3229 2.7583 2.4166 2.2253 2.7389 2.3350 3.8681 2.1859 1.3901 1.2307 2.0919 2.0237 1.5649 1.1319 1.5324 2.1892 1.2286 1.7883 1.4427 1.8389 1.6667 1.6019 1.7121 1.4570 1.5737 1.4900 1.5908 1.3084 3.0022 1.2170 1.2783 5.8308 1.2347 3.7673 1.4693 1.6525 1.2505 1.2869 1.4439 1.1904 2.4868 1.2489 1.0566 3.2206 5.4405 6.3374 6.6962 7.0791 6.4493 1.0382 1.0363 1.0840 1.0642 1.0848 1.0981 1.0975 1.0983 1.0998 1.0997 1.0891 1.0861 1.0856 1.0964 1.0897 1.0875 1.0948 1.1003 1.0964 1.0660 1.0769 1.0774
irintensity: 0.3333 0.3380 0.4604 4.2975 1.9544 0.8812 1.6979 1.8401 0.0627 1.3574 1.5567 4.2433 4.8574 3.1786 1.6790 3.3990 3.1031 9.1074 4.7625 89.8962 15.4054 5.0026 68.6864 4.9641 3.1115 7.5418 15.4786 17.6854 4.1767 47.3452 29.9645 31.8191 1.1977 9.1508 0.3748 11.0530 11.4926 21.6747 2.2294 9.9432 16.5428 71.5072 6.9925 14.3924 4.4249 7.6255 14.7740 35.7156 2.7762 1.6694 3.1500 2.8459 3.2571 0.9623 1.8795 1.6552 10.1705 2.5235 0.6466 0.6853 90.6561 13.4699 14.2150 9.1749 3.9595 2.5557 16.3133 62.7790 15.6083 3.5356 1.5654 2.0697 2.5432 48.8650 152.1616 17.5087 19.8832 182.9865 3.0809 2.9761 18.9154 61.8354 14.1500 40.9476 18.7450 17.3066 121.8437 52.6744 22.7790 4.2854 41.1535 4.7985 2.7392 35.1090 239.7886 281.9648 5.0528 12.8790 11.1449 154.6222 55.4583 82.9784 97.6979 123.4799 1.5409 2.5205 401.2335 26.1942 40.6621 20.4327 16.1926 0.4972 12.3817 10.7055 80.1958 39.6217 28.0620 27.7154 22.4729 2.0144 24.4492 3.3375 5.2470 27.1069 32.9382 6.0543 5.9280 10.5363 57.3405
temp: 298.150 k
press: 1.00000 atm
elementType: 8 8 7 7 6 6 6 6 6 6 6 6 6 6 6 6 6 6 6 6 6 6 6 1 1 1 1 1 1 1 1 1 1 1 1 1 1 1 1 1 1 1 1 1 1
symmnumber: 1
zpe: 971538.9 jmol-1
zpe.correction: 0.370040 hartree
zpe.thermalcorrener: 0.391170 hartree
zpe.thermalcorrenthalpy: 0.392114 hartree
zpe.thermalcorrgfe: 0.318761 hartree
zpe.sumelectzpe: -995.522073 hartree
zpe.sumelectthermal: -995.500942 hartree
zpe.sumelectthermalent: -995.499998 hartree
zpe.sumelectthermalfe: -995.573351 hartree
dipole: -4.4862 -5.7027 -1.2302
dipole: 7.3593
quadrupole: -112.5154 -141.8006 -133.7631
quadrupole: -12.4759 -2.0402 -0.8621
quadrupole: 16.8443 -12.4409 -4.4034 -12.4759 -2.0402 -0.8621
hfenergy: -995.8921122 hartree
pointgroup: C01 [X(C19H22N2O2)]
dipole: -1.7974044 -2.1658703 -0.6794184 debye
polarizability: 373.3131012|12.9937662|194.4896834|8.301837|3.3636487|156.7368868 unknown
InChI: InChI=1S/C19H22N2O2/c1-12(2)20-19(23)13-7-9-15(10-8-13)21-18-16-6-4-3-5-14(16)11-17(18)22/h3-10,12,17-18,20-22H,11H2,1-2H3
charge 0 multiplicity 1
45 atoms
O  -3.04205 2.733352 0.708228
O  4.703915 1.610718 0.52007
N  -1.396025 -0.478873 -0.266227
N  5.152353 -0.548514 -0.206976
C  -2.418492 0.325902 0.416019
C  -2.721772 1.701797 -0.293086
C  -3.922456 1.419854 -1.241213
C  -3.77013 -0.379891 0.366651
C  -4.627166 0.240441 -0.580545
C  -4.192942 -1.507885 1.098675
C  -5.927042 -0.262859 -0.795552
C  -0.024717 -0.236578 -0.184534
C  -5.497069 -2.014846 0.879993
C  -6.356845 -1.394522 -0.059805
C  0.506433 0.878412 0.534512
C  0.889007 -1.118684 -0.838308
C  2.808556 0.185642 -0.017004
C  1.895503 1.072727 0.609055
C  2.274406 -0.90779 -0.753724
C  6.61984 -0.380207 -0.113139
C  4.273907 0.477191 0.119519
C  7.311088 -1.32442 -1.11673
C  7.114997 -0.599993 1.336967
H  -2.08479 0.534077 1.453075
H  -1.837052 2.100448 -0.810002
H  -3.566523 1.144081 -2.253093
H  -4.555201 2.318044 -1.352164
H  -1.716308 -1.284576 -0.803755
H  -3.528047 -1.981804 1.829885
H  -6.598762 0.211308 -1.520302
H  -3.86603 2.463636 1.191448
H  -5.847256 -2.886086 1.444364
H  -7.365892 -1.792996 -0.214998
H  -0.162295 1.59329 1.023841
H  0.499821 -1.966327 -1.416635
H  2.310959 1.930123 1.149222
H  2.933747 -1.591855 -1.302539
H  6.820487 0.672063 -0.386251
H  4.791648 -1.486759 -0.38599
H  8.405812 -1.184047 -1.081392
H  7.105023 -2.386119 -0.874537
H  6.969319 -1.127738 -2.148604
H  6.595661 0.09372 2.019416
H  8.202095 -0.410656 1.409537
H  6.921186 -1.638002 1.667725
