program: Gaussian 09
title: 000255224
version: EM64L-G09RevD.01
frameworkgroup: C1[X(C12H12O4)]
method: RPBEPBE
basis: SDD
operation: Freq
keyword: #pfreq=noraman
keyword: PBEPBE/SDD
title: #p freq=noraman PBEPBE/SDD
converged: NO YES NO NO
title: Mulliken charges:
elementType: O O O O C C C C C C C C C C C C H H H H H H H H H H H H
charge: -0.266140 -0.204726 -0.312875 -0.189951 -0.532209 0.357427 -0.523546 0.180383 -0.008806 -0.520020 -0.468204 0.195802 0.280666 -0.506501 0.245592 -0.750001 0.241727 0.241459 0.254031 0.252553 0.270814 0.290388 0.225677 0.243152 0.237976 0.250599 0.257832 0.256901
chargesum: 0.00000
title: Mulliken charges with hydrogens summed into heavy atoms:
elementType: O O O O C C C C C C C C C C C C
charge: -0.266140 -0.204726 -0.312875 -0.189951 -0.049024 0.357427 -0.016962 0.180383 -0.008806 -0.249206 -0.177815 0.195802 0.280666 0.200304 0.245592 0.015331
polarizability: 2.09885729e+02 -9.29070894e+00 1.56160467e+02 3.58357447e+00 1.27937566e+00 8.16342963e+01
1716.lowfreq: -69.9125 -9.3697 0.0004 0.0006 0.0007 1.8632 4.6235 22.8866 43.8842
frequency: -69.8651 22.6166 43.8682 61.5968 74.4147 82.2767 98.6027 170.8974 180.0172 207.3928 234.9404 254.9936 299.4810 333.9850 354.8503 370.7292 446.7999 470.8196 513.0947 522.4611 562.4644 593.9526 602.4463 623.0193 644.6772 692.0742 712.4764 737.8468 776.7547 822.2195 834.3080 885.6763 907.1368 931.0616 992.9409 996.7635 1000.7929 1012.0823 1042.6020 1096.5590 1109.3210 1136.6653 1138.7086 1144.8981 1157.1641 1175.1499 1201.0497 1225.8568 1252.7040 1271.2789 1295.7755 1382.7824 1387.2042 1406.4877 1431.8031 1447.4034 1452.6642 1456.1698 1457.3642 1461.9597 1470.4659 1478.5119 1585.0208 1612.0050 1635.6051 1677.0681 2988.6297 2998.3374 3008.8918 3018.1023 3044.9577 3075.8026 3096.6016 3098.5302 3127.5727 3141.2643 3156.7289 3165.6610
redmass: 1.0513 7.6759 3.5347 2.2998 2.9473 3.3488 5.8061 5.7084 2.0739 1.8390 3.1949 6.6810 3.5451 4.5354 5.9369 4.9429 3.3394 4.3721 4.9046 3.7043 3.3463 5.2077 5.3611 4.7189 3.6131 5.2389 3.9540 5.1759 5.3959 1.6769 5.0595 1.4713 1.5957 6.1940 2.1203 2.4016 2.1031 3.7235 1.6152 6.2915 1.2913 1.2220 3.4671 1.5079 2.4704 2.0341 1.1195 1.4180 1.5568 2.1945 3.3651 1.6682 2.8902 2.8379 1.1360 1.5832 1.1001 1.0468 1.1981 1.0614 1.0609 2.3229 9.2803 8.7431 10.5943 11.4067 1.0317 1.0598 1.0368 1.0622 1.1022 1.1014 1.0967 1.1016 1.1048 1.1014 1.0923 1.0931
irintensity: 1.2292 1.6463 2.2829 6.2475 1.9921 4.0015 6.4448 2.2286 0.6755 2.9296 4.3436 1.2066 6.6560 1.7021 0.6652 3.2564 6.5358 11.2118 8.4388 8.5250 2.8733 5.1087 14.3739 11.3079 9.0976 9.3731 4.6296 1.2240 10.9110 6.8888 50.4088 37.3988 9.7933 83.6369 76.6626 7.3286 1.3063 11.6792 9.8930 81.8413 8.2256 3.4472 307.3284 47.6715 166.3677 28.2902 0.0320 5.9263 0.9042 200.5144 203.5069 122.0915 43.6342 14.2119 0.5292 4.3894 8.8998 18.2206 55.2186 22.0185 38.4800 37.3787 58.0962 338.7675 81.7870 167.4413 65.4191 24.6857 1.7985 14.0413 6.6614 14.5083 4.3495 34.3343 22.8200 7.4776 3.3995 4.0422
temp: 298.150 k
press: 1.00000 atm
elementType: 8 8 8 8 6 6 6 6 6 6 6 6 6 6 6 6 1 1 1 1 1 1 1 1 1 1 1 1
symmnumber: 1
zpe: 559755.8 jmol-1
zpe.correction: 0.213200 hartree
zpe.thermalcorrener: 0.228019 hartree
zpe.thermalcorrenthalpy: 0.228963 hartree
zpe.thermalcorrgfe: 0.169444 hartree
zpe.sumelectzpe: -764.198091 hartree
zpe.sumelectthermal: -764.183271 hartree
zpe.sumelectthermalent: -764.182327 hartree
zpe.sumelectthermalfe: -764.241847 hartree
dipole: -3.0899 3.7904 -0.5396
dipole: 4.9199
quadrupole: -70.8117 -100.8671 -96.2044
quadrupole: 12.2836 3.4420 5.9266
quadrupole: 18.4827 -11.5727 -6.9100 12.2836 3.4420 5.9266
hfenergy: -764.4112904 hartree
pointgroup: C01 [X(C12H12O4)]
dipole: 1.135613 1.5138284 0.4067705 debye
polarizability: 207.2505397|10.3617459|156.6814548|16.4757747|3.9084552|83.7484983 unknown
InChI: InChI=1S/C12H12O4/c1-7(13)16-12-6-9-8(3-4-10(9)14)5-11(12)15-2/h5-6H,3-4H2,1-2H3
charge 0 multiplicity 1
28 atoms
O  1.326521 2.608678 0.449945
O  -2.869375 -2.480769 -0.185148
O  2.049473 -0.227229 0.829448
O  2.403844 -1.611627 -1.039904
C  -3.398535 1.184514 -0.387456
C  -1.911432 0.987309 -0.110637
C  -3.975915 -0.258376 -0.485701
C  -1.584925 -0.390244 -0.020922
C  -2.795386 -1.222681 -0.22139
C  -0.909954 1.955302 0.046475
C  -0.267656 -0.81502 0.246732
C  0.429736 1.552436 0.296052
C  0.732433 0.15661 0.414072
C  2.767997 2.437129 0.181502
C  2.792339 -1.169124 0.05479
C  4.076008 -1.518329 0.771975
H  -3.876384 1.7624 0.425283
H  -3.557396 1.758199 -1.318974
H  -4.400519 -0.480254 -1.481623
H  -4.776316 -0.453257 0.250267
H  -1.11026 3.028725 -0.02593
H  -0.038089 -1.881386 0.331073
H  2.930129 1.91023 -0.776648
H  3.262654 1.893605 1.001734
H  3.15494 3.465253 0.113258
H  4.92918 -1.386974 0.08493
H  4.049286 -2.584969 1.057808
H  4.214502 -0.906153 1.674089
