program: Gaussian 09
title: 000255219
version: EM64L-G09RevD.01
frameworkgroup: C1[X(C17H16N2O2)]
method: RPBEPBE
basis: SDD
operation: Freq
keyword: #p
keyword: freq=noraman
keyword: PBEPBE/SDD
title: #p freq=noraman PBEPBE/SDD
converged: YES YES NO NO
title: Mulliken charges:
elementType: O O N N C C C C C C C C C C C C C C C C C H H H H H H H H H H H H H H H H
charge: -0.258579 -0.203972 -0.125811 -0.365887 -0.381709 -0.486523 -0.586618 0.253925 0.145183 0.510401 0.507262 -0.376339 -0.420582 -0.329449 -0.343506 -0.227521 -0.228024 -0.218707 -0.214246 -0.237311 -0.238735 0.232429 0.245174 0.251469 0.248336 0.225385 0.272203 0.270370 0.228226 0.245772 0.238392 0.228963 0.227444 0.227066 0.226025 0.230992 0.228499
chargesum: 0.00000
title: Mulliken charges with hydrogens summed into heavy atoms:
elementType: O O N N C C C C C C C C C C C C C C C C C
charge: -0.258579 -0.203972 -0.125811 -0.365887 0.095894 0.013282 -0.089030 0.253925 0.145183 0.510401 0.507262 -0.105969 -0.192356 -0.083677 -0.105114 0.001443 -0.000580 0.008359 0.011780 -0.006320 -0.010236
polarizability: 2.52329897e+02 1.43090992e+01 2.02455260e+02 -1.86693088e+01 1.17038630e+01 1.26001006e+02
1716.lowfreq: -4.9606 -0.0006 0.0002 0.0005 3.8305 11.9571 19.4325 28.6633 35.4529
frequency: 19.3440 28.6439 35.3312 39.1577 64.2641 84.5171 93.0644 148.9531 169.6805 202.5644 225.0483 254.9560 277.3905 296.4338 388.1614 402.5061 404.7915 406.0807 431.2574 441.1691 469.8271 503.1536 514.0367 564.5265 602.4995 613.2094 617.0090 618.7786 664.1633 692.1937 693.9227 708.4527 713.4725 751.2191 763.2377 812.4723 836.3109 841.9402 851.7587 861.7277 909.9917 929.9622 946.3292 967.4482 983.9866 987.2987 989.8637 991.6149 992.6509 1001.8182 1017.1421 1026.7776 1029.2391 1053.3343 1078.9797 1085.8175 1106.6785 1156.1174 1170.3473 1172.0967 1173.7734 1182.2996 1190.6748 1205.3586 1209.8264 1232.9745 1263.1365 1300.7552 1315.0357 1324.1766 1330.9649 1346.0346 1361.1262 1382.5001 1385.7904 1407.3934 1440.4699 1442.4698 1443.5884 1458.8465 1481.7295 1483.8767 1489.7508 1594.1848 1596.7917 1608.8581 1611.3690 1614.1665 1636.1524 2970.6335 3003.2508 3004.2970 3057.8875 3078.7901 3097.2154 3111.2142 3125.5462 3129.4407 3136.4055 3139.9518 3147.4923 3152.5907 3163.5643 3163.9522 3174.0574
redmass: 4.9052 4.1231 4.1774 5.6705 5.4137 5.3595 5.4148 4.9168 3.7557 4.2817 3.9486 5.6503 5.3736 4.1138 2.3857 3.3784 2.8513 2.8024 8.5541 4.2846 3.6049 4.9883 3.5655 4.3986 3.9920 5.8602 6.2913 4.5261 5.6783 2.5828 2.5197 2.3065 4.2525 1.9872 1.9425 3.3754 1.3908 2.6449 2.4232 1.2595 1.4408 1.5456 1.9906 1.3973 1.3762 2.5539 5.1473 5.7065 1.5434 1.3303 2.3979 2.2480 2.0630 2.0743 1.7551 1.6281 2.8341 1.8920 2.6114 1.0726 1.0652 1.1129 1.1473 1.5677 2.6358 2.2273 1.8850 2.1755 1.3178 1.4839 1.4969 1.6579 1.4038 6.4208 10.0035 2.1665 2.2518 1.8703 1.1767 1.1303 2.2703 2.1327 1.1586 5.9999 7.2185 7.0496 7.1365 6.1851 10.3490 1.0679 1.0652 1.0633 1.0963 1.0997 1.0965 1.0880 1.0862 1.0848 1.0914 1.0888 1.0961 1.0937 1.0974 1.1015 1.1003
irintensity: 0.0210 0.1927 0.1533 0.5291 7.9242 3.8482 1.8219 0.1211 2.4118 2.2739 0.9687 4.8834 7.5738 6.3361 1.3218 3.2228 0.2424 0.5614 2.3427 7.7519 7.2647 26.8382 8.5583 19.3666 11.0979 8.4880 2.2597 30.1998 1.2506 17.6069 37.6228 36.3753 33.9564 3.1331 69.7130 8.3250 0.2882 5.1655 4.9596 0.1174 1.1547 6.8517 2.5910 0.2373 0.3100 4.0420 0.4940 2.1620 2.0672 1.1448 2.8839 7.6958 11.1633 11.4654 8.2918 14.4036 5.1033 25.4789 334.4718 10.8189 5.0673 4.3430 4.8961 53.4104 7.4415 4.6623 116.6819 45.8923 2.6428 49.5873 48.5166 71.0275 29.9166 16.8164 2.1065 154.0049 7.7279 3.2107 17.4053 33.9412 43.1375 9.1096 32.2353 6.4847 142.2245 82.7275 108.4706 37.3031 186.0761 37.5129 13.9519 38.7646 24.4483 3.6077 8.7001 11.0358 0.0388 0.2325 10.9853 7.0469 29.0113 35.2314 19.7360 28.2135 6.0927
temp: 298.150 k
press: 1.00000 atm
elementType: 8 8 7 7 6 6 6 6 6 6 6 6 6 6 6 6 6 6 6 6 6 1 1 1 1 1 1 1 1 1 1 1 1 1 1 1 1
symmnumber: 1
zpe: 770844.2 jmol-1
zpe.correction: 0.293599 hartree
zpe.thermalcorrener: 0.311240 hartree
zpe.thermalcorrenthalpy: 0.312184 hartree
zpe.thermalcorrgfe: 0.245153 hartree
zpe.sumelectzpe: -915.901082 hartree
zpe.sumelectthermal: -915.883441 hartree
zpe.sumelectthermalent: -915.882497 hartree
zpe.sumelectthermalfe: -915.949528 hartree
dipole: 3.6549 1.2471 -0.4101
dipole: 3.8835
quadrupole: -112.9533 -110.8385 -129.1543
quadrupole: 11.3770 -8.8341 11.4822
quadrupole: 4.6954 6.8102 -11.5056 11.3770 -8.8341 11.4822
hfenergy: -916.1946809 hartree
pointgroup: C01 [X(C17H16N2O2)]
dipole: -1.4237822 -0.5230456 -0.1836067 debye
polarizability: 251.2329046|15.2729765|203.5663638|20.3680515|-9.7245379|125.986894 unknown
InChI: InChI=1S/C17H16N2O2/c20-16-11-12-18(13-14-7-3-1-4-8-14)17(21)19(16)15-9-5-2-6-10-15/h1-10H,11-13H2
charge 0 multiplicity 1
37 atoms
O  0.331052 0.653204 1.610238
O  2.636012 -2.238912 -1.286503
N  -0.83638 -1.13371 0.660735
N  1.441672 -0.696633 0.022735
C  -0.920379 -2.130117 -0.423879
C  0.407844 -2.89144 -0.514896
C  -2.067873 -0.786392 1.413518
C  0.285662 -0.334918 0.823518
C  1.592837 -1.940581 -0.649841
C  -3.084032 -0.011348 0.577561
C  2.545721 0.257747 0.000564
C  -2.830931 1.341898 0.229108
C  -4.282513 -0.623217 0.135601
C  3.810112 -0.116186 0.503977
C  2.33924 1.547089 -0.536534
C  -3.759801 2.06328 -0.551544
C  -5.215168 0.098706 -0.645415
C  4.874879 0.809888 0.469336
C  3.404994 2.472161 -0.560496
C  -4.954262 1.443623 -0.992239
C  4.675587 2.105811 -0.059615
H  -1.747722 -2.823185 -0.192306
H  -1.159015 -1.641587 -1.390841
H  0.427417 -3.567972 -1.384453
H  0.556764 -3.505199 0.3948
H  -2.513701 -1.728261 1.785053
H  -1.741995 -0.18555 2.279536
H  -1.910226 1.820556 0.583416
H  -4.493782 -1.664936 0.410547
H  3.960963 -1.121856 0.906876
H  1.352667 1.825105 -0.921223
H  -3.559199 3.109081 -0.810291
H  -6.140896 -0.384088 -0.978213
H  5.857557 0.51932 0.85628
H  3.24346 3.474908 -0.970786
H  -5.676079 2.006026 -1.595062
H  5.502918 2.823688 -0.081861
