program: Gaussian 09
title: 000255207
version: EM64L-G09RevD.01
frameworkgroup: C1[X(C10H15N3)]
method: RPBEPBE
basis: SDD
operation: Freq
keyword: #pfreq=noraman
keyword: PBEPBE/SDD
title: #p freq=noraman PBEPBE/SDD
converged: YES YES NO NO
title: Mulliken charges:
elementType: N N N C C C C C C C C C C H H H H H H H H H H H H H H H
charge: -0.004222 -0.397292 -0.082889 -0.469126 -0.355994 0.148521 -0.678570 -0.810575 0.182629 -0.320321 -0.165119 -0.204764 -0.327919 0.227801 0.196413 0.196413 0.219891 0.207832 0.214429 0.219720 0.239862 0.238997 0.247279 0.310560 0.274113 0.231848 0.227814 0.232668
chargesum: 0.00000
title: Mulliken charges with hydrogens summed into heavy atoms:
elementType: N N N C C C C C C C C C C
charge: -0.004222 -0.086731 -0.082889 -0.044913 0.060311 0.148521 -0.036588 -0.084437 0.182629 -0.046208 0.066729 0.023050 -0.095251
polarizability: 2.33169227e+02 1.31932880e+01 1.25583434e+02 -7.70563880e+00 5.67675667e+00 7.49073877e+01
1716.lowfreq: -16.0313 -8.1618 -5.2432 0.0004 0.0006 0.0008 38.1381 46.6790 62.1789
frequency: 37.8861 46.6268 62.1754 87.9660 107.3170 127.3112 161.4126 221.5749 226.1858 241.1129 276.4732 337.2310 365.3311 412.4938 467.5898 502.1766 526.5568 546.9856 605.8800 619.1919 657.8029 741.9001 742.4107 777.5373 811.0963 864.4591 870.3797 884.2127 897.3901 946.7363 953.2239 984.9902 992.4156 1007.6190 1030.2988 1048.0851 1060.6781 1092.2774 1093.3063 1142.7078 1156.6748 1225.8718 1262.4247 1264.6809 1282.7747 1285.7936 1316.9079 1338.4891 1347.5136 1385.4177 1388.0921 1418.6184 1438.9231 1452.3137 1464.2176 1472.3229 1474.1728 1476.3505 1485.2430 1512.1225 1565.9404 1594.3404 1601.0431 2953.0543 2960.0487 2973.3805 2978.6428 3022.1140 3026.0351 3055.9645 3073.3563 3075.0903 3098.9471 3128.9127 3140.3759 3171.2684 3191.4882 3441.2274
redmass: 3.7144 3.2907 2.3627 2.4072 3.3953 1.3017 2.1783 3.7698 1.2512 3.4029 3.1889 2.8066 3.7853 3.5641 2.7279 2.3617 3.4176 3.9524 1.6291 5.8891 4.3794 1.2939 1.7258 1.8258 3.0697 1.3110 3.9696 1.3319 2.0013 1.4224 6.2763 1.6325 1.3126 1.5438 2.2691 2.6890 2.1420 1.6220 2.0450 2.3588 1.0980 1.4248 1.9030 1.6395 1.6858 1.1766 1.9032 1.6725 3.7042 1.2271 1.2123 1.8208 1.9653 1.1493 1.2222 1.0498 1.0564 1.0526 1.0802 2.1157 5.0257 6.3232 8.0405 1.0402 1.0638 1.0358 1.0613 1.0972 1.0973 1.0981 1.1009 1.0997 1.0953 1.0885 1.0904 1.0978 1.0962 1.0744
irintensity: 0.1383 0.7551 0.9663 1.6490 1.4528 4.1006 0.9960 0.4226 0.1124 4.1653 1.4271 11.5975 4.2363 0.8470 13.9146 27.5538 1.3945 1.8856 60.4075 6.2720 12.0579 7.3973 17.4017 71.7222 1.2982 1.9459 9.3326 1.5707 6.7148 1.7520 10.9949 15.3560 1.1335 3.3931 3.1281 12.5570 31.3042 0.7251 20.0037 126.9528 1.0819 5.1854 28.7943 3.1155 15.8149 7.7927 22.7060 0.4762 12.1518 22.1732 16.3196 32.0021 64.7584 41.7668 132.3204 14.7637 1.0988 24.8530 16.3419 195.7257 34.5010 314.2389 98.8633 20.1502 31.6765 54.0808 33.1619 20.1154 4.4060 4.0860 74.7803 54.5963 21.4288 21.0586 17.8108 30.3151 2.4958 7.7653
temp: 298.150 k
press: 1.00000 atm
elementType: 7 7 7 6 6 6 6 6 6 6 6 6 6 1 1 1 1 1 1 1 1 1 1 1 1 1 1 1
symmnumber: 1
zpe: 616550.3 jmol-1
zpe.correction: 0.234832 hartree
zpe.thermalcorrener: 0.248430 hartree
zpe.thermalcorrenthalpy: 0.249374 hartree
zpe.thermalcorrgfe: 0.193419 hartree
zpe.sumelectzpe: -553.308866 hartree
zpe.sumelectthermal: -553.295268 hartree
zpe.sumelectthermalent: -553.294324 hartree
zpe.sumelectthermalfe: -553.350278 hartree
dipole: 1.9206 0.1721 -0.0514
dipole: 1.9289
quadrupole: -68.7632 -73.8956 -82.0260
quadrupole: 7.2299 -0.2397 0.2925
quadrupole: 6.1317 0.9994 -7.1311 7.2299 -0.2397 0.2925
hfenergy: -553.5436976 hartree
pointgroup: C01 [X(C10H15N3)]
dipole: -0.7564259 -0.0612046 -0.0014665 debye
polarizability: 233.6142673|12.5426995|123.6633333|3.7668804|-10.8626163|76.3824481 unknown
InChI: InChI=1S/C10H15N3/c1-3-6-9(2)12-13-10-7-4-5-8-11-10/h4-5,7-8,13H,3,6H2,1-2H3
charge 0 multiplicity 1
28 atoms
N  -0.764173 -0.012584 -0.275665
N  0.351038 -0.771184 0.035366
N  2.631054 -1.079958 0.330198
C  -3.145222 0.274624 -0.571406
C  -4.069709 0.540235 0.650596
C  -1.94882 -0.594501 -0.243112
C  -5.308998 1.377855 0.269482
C  -2.167682 -2.058393 0.108857
C  1.629445 -0.207853 -0.001643
C  1.85757 1.152028 -0.354603
C  3.187677 1.610052 -0.358672
C  4.243261 0.724368 -0.018639
C  3.908766 -0.606116 0.316697
H  -2.778187 1.23838 -0.96871
H  -3.747257 -0.207773 -1.370451
H  -4.39617 -0.423125 1.091653
H  -3.484642 1.062842 1.431718
H  -5.923527 0.856042 -0.488433
H  -5.011339 2.354965 -0.155042
H  -5.948869 1.572266 1.149481
H  -1.839551 -2.290066 1.143099
H  -1.604219 -2.728503 -0.572557
H  -3.233415 -2.325227 0.03209
H  0.308923 -1.762363 0.305609
H  1.010314 1.791899 -0.608261
H  3.403168 2.650786 -0.624957
H  5.286652 1.052436 -0.01377
H  4.684414 -1.331933 0.587475
