program: Gaussian 09
title: 000255178
version: EM64L-G09RevD.01
frameworkgroup: C1[X(C13H18O)]
method: RPBEPBE
basis: SDD
operation: Freq
keyword: #pfreq=noraman
keyword: PBEPBE/SDD
title: #p freq=noraman PBEPBE/SDD
converged: YES YES NO NO
title: Mulliken charges:
elementType: O C C C C C C C C C C C C C H H H H H H H H H H H H H H H H H H
charge: -0.446629 -0.067598 -0.228230 -0.500123 -0.522575 0.055717 0.141347 -0.755214 0.356525 0.344921 -0.449299 -0.454400 -0.847606 -0.828875 0.231910 0.224858 0.207537 0.217674 0.220410 0.233650 0.217028 0.215960 0.234983 0.231789 0.229460 0.332224 0.225803 0.269082 0.225362 0.226199 0.226327 0.231785
chargesum: 0.00000
title: Mulliken charges with hydrogens summed into heavy atoms:
elementType: O C C C C C C C C C C C C C
charge: -0.114405 0.164312 -0.003372 -0.074912 -0.068515 0.055717 0.141347 -0.087243 0.356525 0.344921 -0.217510 -0.224940 -0.127359 -0.144564
polarizability: 1.60085520e+02 -1.77397026e+00 1.58762903e+02 1.85830798e+00 5.21851974e+00 9.74646136e+01
1716.lowfreq: -16.1716 -11.9320 -7.4361 -0.0006 0.0001 0.0006 73.1027 81.6254 128.6071
frequency: 73.0345 81.6023 128.6052 164.3705 169.4367 174.7025 188.2618 217.4996 235.4667 265.0778 274.5634 298.9277 304.7104 325.9000 380.7774 429.5569 455.0478 475.1259 488.9236 501.8414 533.5348 578.5329 641.6164 680.2202 721.2866 754.7517 795.8776 821.8002 845.1061 879.6255 930.0924 943.4310 953.2405 957.6302 974.8578 995.9587 1024.7483 1039.1787 1041.3377 1049.4653 1076.3608 1096.7446 1146.4706 1171.3563 1178.7825 1196.7746 1203.4226 1211.2666 1259.2472 1260.2175 1298.9142 1314.6016 1331.6843 1347.3052 1356.1766 1362.4759 1377.4566 1389.4059 1396.9163 1399.2505 1413.9792 1456.3685 1466.9521 1467.5760 1470.4866 1473.6084 1475.9994 1477.4723 1488.2448 1490.5933 1590.3012 1607.2626 2954.2054 2966.6775 2968.8047 2971.5395 2976.1082 3004.3699 3012.2519 3030.5039 3035.8699 3038.9643 3054.4036 3068.4728 3074.2205 3081.1081 3088.9791 3113.7055 3138.7430 3556.9057
redmass: 3.9390 3.0884 2.5637 1.0749 1.2276 2.2755 1.5332 2.9449 1.5788 1.3698 1.9026 2.6890 2.7287 2.9335 2.6641 3.6602 4.6339 4.2316 3.1593 3.6445 2.9147 3.8519 2.7465 3.0101 4.8911 4.0660 2.4007 1.2464 2.3819 3.3218 2.2870 1.8120 1.5329 1.8398 2.2990 1.7095 1.5900 1.5904 1.7341 1.5578 2.0576 1.9150 1.2605 1.3258 1.6211 1.3564 2.0101 1.5585 2.1431 2.5299 1.4790 1.7659 1.5655 2.0474 1.4182 1.3753 2.0385 1.2241 1.2308 1.2934 3.1620 1.1455 1.1133 1.0748 1.0622 2.4747 1.0842 1.1311 1.0689 1.0965 5.7667 7.1907 1.0658 1.0381 1.0632 1.0399 1.0362 1.0855 1.0908 1.0885 1.0970 1.0967 1.0931 1.0991 1.0993 1.0980 1.1001 1.0868 1.0968 1.0661
irintensity: 1.8015 0.3571 3.1592 4.9902 2.9655 0.6522 0.0248 2.9329 0.8018 97.4799 17.0020 8.9069 2.2199 1.9212 11.0785 0.6393 2.2937 1.1859 1.3186 5.1413 1.9656 1.1584 0.4728 8.0125 0.7709 2.8999 8.6216 34.3836 15.5254 45.0438 4.1286 12.5180 9.5623 8.2708 13.3951 11.1579 1.6945 5.2487 1.5909 17.5121 0.3805 2.8717 2.2754 4.6718 5.2807 30.4898 7.5572 2.9908 0.8930 1.2894 2.7086 3.1340 2.5018 4.6398 15.7007 22.4419 1.9184 20.2602 27.1322 1.0862 4.5126 11.8018 9.5144 16.1203 5.6665 22.8540 2.7043 18.6004 4.2245 27.8985 3.8925 2.5858 23.4463 40.1067 35.3262 28.5330 27.0848 26.1127 47.8820 23.0191 52.6253 17.4583 20.7844 32.6315 52.4302 23.1114 11.7538 13.3455 35.3643 5.4951
temp: 298.150 k
press: 1.00000 atm
elementType: 8 6 6 6 6 6 6 6 6 6 6 6 6 6 1 1 1 1 1 1 1 1 1 1 1 1 1 1 1 1 1 1
symmnumber: 1
zpe: 724848.7 jmol-1
zpe.correction: 0.276080 hartree
zpe.thermalcorrener: 0.290144 hartree
zpe.thermalcorrenthalpy: 0.291089 hartree
zpe.thermalcorrgfe: 0.236787 hartree
zpe.sumelectzpe: -580.355592 hartree
zpe.sumelectthermal: -580.341528 hartree
zpe.sumelectthermalent: -580.340584 hartree
zpe.sumelectthermalfe: -580.394886 hartree
dipole: 0.8562 -1.8767 0.3820
dipole: 2.0979
quadrupole: -84.5543 -82.1058 -85.9684
quadrupole: 3.3455 -2.6352 3.5542
quadrupole: -0.3448 2.1037 -1.7589 3.3455 -2.6352 3.5542
hfenergy: -580.6316727 hartree
pointgroup: C01 [X(C13H18O1)]
dipole: 0.2610875 0.7670848 -0.1570199 debye
polarizability: 159.7138093|1.8547973|159.2094103|-2.4514375|4.485369|97.3898165 unknown
InChI: InChI=1S/C13H18O/c1-8-4-5-9(2)12-11(8)7-6-10(3)13(12)14/h4-5,10,13-14H,6-7H2,1-3H3
charge 0 multiplicity 1
32 atoms
O  -1.764923 -1.540131 1.440307
C  -2.457485 0.232185 -0.176993
C  -1.479458 -0.931024 0.101823
C  -2.021799 1.466891 0.644368
C  -0.609667 1.940677 0.243231
C  -0.004366 -0.55016 -0.001992
C  0.406983 0.811937 0.086278
C  -2.564769 0.528234 -1.691872
C  0.961428 -1.592867 -0.163543
C  1.794923 1.143817 0.001325
C  2.327877 -1.245509 -0.234962
C  2.737197 0.103972 -0.158047
C  0.541503 -3.051074 -0.258789
C  2.266128 2.586659 0.078108
H  -3.448808 -0.104259 0.184539
H  -1.707973 -1.763081 -0.587559
H  -2.036682 1.205547 1.722492
H  -2.746285 2.292606 0.512104
H  -0.240726 2.672637 0.987805
H  -0.665764 2.502576 -0.713236
H  -2.959745 -0.349752 -2.236207
H  -3.250595 1.375542 -1.877838
H  -1.584113 0.780238 -2.134761
H  3.077883 -2.036195 -0.35539
H  3.803746 0.351947 -0.220531
H  -1.314845 -0.985744 2.127762
H  1.419453 -3.716282 -0.193817
H  -0.163332 -3.316756 0.548416
H  0.03381 -3.26648 -1.219776
H  1.780745 3.220924 -0.688168
H  2.036086 3.043798 1.060489
H  3.357076 2.652326 -0.072767
