program: Gaussian 09
title: 000255176
version: EM64L-G09RevD.01
frameworkgroup: C1[X(C20H22O3)]
method: RPBEPBE
basis: SDD
operation: Freq
keyword: #pfreq=noraman
keyword: PBEPBE/SDD
title: #p freq=noraman PBEPBE/SDD
converged: YES YES NO NO
title: Mulliken charges:
elementType: O O O C C C C C C C C C C C C C C C C C C C C H H H H H H H H H H H H H H H H H H H H H H
charge: -0.353011 -0.184132 -0.184110 -0.238800 -0.238811 0.559216 0.559244 -0.689344 -0.688284 -0.689384 -0.688238 -0.455918 -0.455946 -0.387858 -0.387827 0.245370 0.245322 -0.339247 -0.339271 -0.352286 -0.352301 0.171117 0.171088 0.212740 0.212745 0.211692 0.216506 0.229195 0.230511 0.216099 0.211840 0.211657 0.216509 0.229200 0.230502 0.216097 0.211875 0.240016 0.240025 0.235013 0.235008 0.268874 0.268882 0.264216 0.264204
chargesum: 0.00000
title: Mulliken charges with hydrogens summed into heavy atoms:
elementType: O O O C C C C C C C C C C C C C C C C C C C C
charge: -0.353011 -0.184132 -0.184110 -0.026060 -0.026066 0.559216 0.559244 -0.031951 -0.029833 -0.032017 -0.029765 -0.215901 -0.215920 -0.152845 -0.152818 0.245370 0.245322 -0.070372 -0.070389 -0.088070 -0.088097 0.171117 0.171088
polarizability: 3.47609167e+02 4.52091408e-02 2.30632726e+02 -7.93070928e+00 3.94059945e-02 1.51150571e+02
1716.lowfreq: -0.0004 0.0007 0.0007 4.9736 5.1528 9.1225 15.0946 18.3616 22.2254
frequency: 15.0200 17.9808 22.2243 34.3165 48.4978 61.7188 71.6808 79.6240 93.1166 138.2102 175.8911 183.4275 185.8988 186.8536 212.7240 213.3383 226.4356 240.8155 248.0214 256.9335 277.2985 330.6714 346.5129 347.2359 363.7678 407.5279 408.0338 426.8654 471.2857 482.5089 497.9763 535.1831 536.4960 576.1505 606.0277 631.5514 633.5679 667.3661 671.1450 695.4544 745.2437 761.3147 765.3151 788.4267 788.9344 855.9639 858.2040 865.6889 868.4221 889.6039 889.7204 918.1686 918.2223 949.6050 955.8498 955.9872 969.9769 984.7867 986.4702 994.0920 994.4920 1016.4008 1016.6635 1051.1559 1051.3208 1109.9686 1110.0848 1113.5520 1114.7322 1155.1579 1155.4305 1174.3605 1189.9986 1215.8129 1220.7397 1221.2386 1261.5638 1291.9014 1292.4962 1309.0375 1309.1079 1328.0776 1328.5417 1378.0583 1378.0895 1392.6199 1392.7240 1398.1387 1398.2740 1414.9041 1415.2681 1467.0186 1467.0997 1468.0528 1468.0754 1478.6544 1478.7224 1483.7882 1484.3146 1500.0624 1501.9583 1574.1302 1574.4941 1616.6640 1617.7509 1627.7438 1684.4936 2976.0948 2976.1026 2978.9123 2978.9785 2985.7218 2985.7986 3069.7694 3069.7842 3077.2697 3077.3790 3079.5839 3079.6012 3083.9042 3083.9401 3127.7121 3127.7418 3133.4161 3133.5790 3158.5355 3158.6189 3174.1575 3174.2194
redmass: 2.9070 3.1089 4.4592 4.0634 3.7845 4.5198 5.5726 4.6236 5.9469 4.7876 4.9454 3.3064 3.3532 2.9281 1.1647 1.1493 2.1299 1.6510 1.4772 2.1809 3.3532 2.7811 4.0066 4.2739 3.9298 2.8469 2.8548 5.1659 3.4136 3.1475 6.6938 3.1364 3.0753 4.1171 3.5632 7.0926 6.5690 4.2713 4.1211 4.2416 4.5441 4.6546 4.0576 5.9785 5.9535 1.3067 1.2710 1.5835 1.7104 2.5743 2.5774 1.1829 1.1830 9.5265 1.4574 1.4569 8.3049 1.3693 1.3645 1.3837 1.3820 2.6948 2.8485 1.5926 1.5526 2.5800 2.5796 1.4821 1.4766 1.7524 1.7376 1.4063 1.1188 2.0103 1.9423 2.2272 4.5990 1.5610 1.5643 1.3203 1.3199 1.6647 1.6510 1.1918 1.1919 2.4892 2.4702 1.4505 1.4624 2.9196 2.9009 1.0455 1.0455 1.0497 1.0497 1.0489 1.0488 1.1904 1.1623 2.0173 2.1484 7.0372 6.9632 6.3996 6.3349 12.0195 12.6684 1.0349 1.0349 1.0353 1.0353 1.0845 1.0845 1.1002 1.1002 1.0993 1.0992 1.1007 1.1007 1.0999 1.0999 1.0890 1.0890 1.0889 1.0889 1.0955 1.0956 1.0949 1.0948
irintensity: 0.0783 0.3848 0.5430 0.0335 0.0301 0.0030 0.6133 0.8923 0.1336 1.0559 0.0016 0.2014 0.0213 1.6302 0.2341 0.0355 1.8032 0.0020 0.3310 0.0059 0.3536 0.6839 0.1889 0.0195 6.9507 0.0189 0.0273 1.5097 8.2507 0.3804 1.6408 6.3450 20.2120 18.4876 0.0261 6.7277 0.1319 4.2063 65.7270 38.9971 2.7864 0.4899 33.2638 10.2746 36.0405 10.2280 0.3567 61.5678 13.6202 3.7291 4.9920 4.3240 3.5608 1853.7719 0.1310 0.1435 0.1465 6.8749 0.0893 0.2493 0.0194 4.9841 61.5704 41.0985 10.1862 0.7743 0.7873 18.2540 16.9529 4.0675 0.0631 326.5196 3.4316 305.1193 1.6829 23.0209 10.1198 10.7157 5.0951 0.5468 0.5058 5.4629 1.4815 15.1155 14.8693 1.5464 1.5256 3.9191 10.9263 25.6400 6.1548 4.8143 4.8357 1.4314 1.9436 18.7851 18.9301 23.3895 0.5227 10.9865 8.9442 12.3533 4.7167 161.5897 59.6598 95.2247 378.1141 28.9755 28.8423 34.5779 34.1660 21.4550 16.3301 0.8031 0.7448 203.0290 1.0863 14.9916 33.2795 23.5743 52.2098 25.4770 2.9966 12.6705 18.6218 14.3973 2.4791 3.7984 2.5017
temp: 298.150 k
press: 1.00000 atm
elementType: 8 8 8 6 6 6 6 6 6 6 6 6 6 6 6 6 6 6 6 6 6 6 6 1 1 1 1 1 1 1 1 1 1 1 1 1 1 1 1 1 1 1 1 1 1
symmnumber: 1
zpe: 961313.7 jmol-1
zpe.correction: 0.366145 hartree
zpe.thermalcorrener: 0.389268 hartree
zpe.thermalcorrenthalpy: 0.390212 hartree
zpe.thermalcorrgfe: 0.310120 hartree
zpe.sumelectzpe: -999.354221 hartree
zpe.sumelectthermal: -999.331098 hartree
zpe.sumelectthermalent: -999.330154 hartree
zpe.sumelectthermalfe: -999.410247 hartree
dipole: -0.0017 -5.7784 -0.0029
dipole: 5.7784
quadrupole: -92.0578 -147.4771 -139.1170
quadrupole: 0.0018 -1.7607 -0.0009
quadrupole: 34.1595 -21.2598 -12.8997 0.0018 -1.7607 -0.0009
hfenergy: -999.7203665 hartree
pointgroup: C01 [X(C20H22O3)]
dipole: -0.0028432 -2.2734084 0.0020696 debye
polarizability: 347.3892899|-0.2306055|230.6331152|-10.2937371|-0.0550965|151.3700586 unknown
InChI: InChI=1S/C20H22O3/c1-13(2)15-5-9-17(10-6-15)19(21)23-20(22)18-11-7-16(8-12-18)14(3)4/h5-14H,1-4H3
charge 0 multiplicity 1
45 atoms
O  -0.001153 0.883826 0.001053
O  -1.058035 2.709861 1.04581
O  1.059455 2.703296 -1.051207
C  -6.117498 -1.496413 0.039042
C  6.107662 -1.515404 -0.040609
C  -4.813068 -0.705993 0.153252
C  4.805528 -0.721179 -0.154704
C  -6.018987 -2.864119 0.767809
C  -6.538795 -1.688465 -1.44299
C  6.002635 -2.886183 -0.762651
C  6.532421 -1.7019 1.441161
C  -4.782037 0.549931 0.815639
C  4.777074 0.532681 -0.821097
C  -3.601206 -1.20432 -0.398599
C  3.593342 -1.213745 0.401579
C  -2.383775 0.776214 0.372338
C  2.380607 0.768269 -0.372879
C  -3.586936 1.28529 0.927669
C  3.584117 1.271578 -0.93269
C  -2.400451 -0.478327 -0.293382
C  2.394707 -0.484201 0.296798
C  -1.150891 1.591064 0.510675
C  1.150123 1.586788 -0.510935
H  -6.911242 -0.906369 0.539628
H  6.901952 -0.93031 -0.546116
H  -5.250997 -3.509604 0.302738
H  -6.985633 -3.397929 0.71452
H  -5.752555 -2.733652 1.831973
H  -6.64302 -0.717394 -1.959043
H  -7.506948 -2.21925 -1.501113
H  -5.791887 -2.28752 -1.99608
H  5.233968 -3.527035 -0.292305
H  6.967722 -3.422834 -0.709673
H  5.7335 -2.759858 -1.826634
H  6.64143 -0.728761 1.952307
H  7.498888 -2.235763 1.499139
H  5.784941 -2.295702 1.999118
H  -5.707379 0.951315 1.245813
H  5.702714 0.929618 -1.254736
H  -3.59788 -2.170034 -0.91699
H  3.588124 -2.177758 0.923116
H  -3.562241 2.254903 1.436283
H  3.561389 2.239626 -1.444369
H  -1.472656 -0.86614 -0.723049
H  1.466669 -0.867604 0.729887
