program: Gaussian 09
title: 000018246
version: EM64L-G09RevD.01
frameworkgroup: C1[X(C22H27NO3)]
method: RPBEPBE
basis: SDD
operation: Freq
keyword: #p
keyword: freq=noraman
keyword: PBEPBE/SDD
title: #p freq=noraman PBEPBE/SDD
converged: YES YES NO NO
title: Mulliken charges:
elementType: O O O N C C C C C C C C C C C C C C C C C C C C C C H H H H H H H H H H H H H H H H H H H H H H H H H H H
charge: -0.247893 -0.298791 -0.257807 -0.124881 -0.068231 -0.462651 -0.473755 -0.365298 -0.321458 -0.324562 -0.694092 -0.015084 0.214249 0.357975 0.392096 -0.396970 -0.408626 -0.351105 -0.371802 -0.530190 -0.236973 -0.224591 -0.237767 -0.235752 -0.242644 -0.248829 0.228334 0.215277 0.248512 0.225473 0.219402 0.229585 0.176762 0.241816 0.235820 0.183308 0.209307 0.209908 0.226400 0.223114 0.262254 0.280574 0.261317 0.242720 0.222568 0.249358 0.231488 0.226205 0.222921 0.227160 0.222783 0.228395 0.224672
chargesum: 0.00000
title: Mulliken charges with hydrogens summed into heavy atoms:
elementType: O O O N C C C C C C C C C C C C C C C C C C C C C C
charge: -0.247893 -0.298791 -0.257807 -0.124881 0.160103 0.001138 -0.028881 0.041049 0.156177 0.068052 -0.034670 -0.015084 0.214249 0.357975 0.392096 -0.134716 -0.128052 -0.089788 -0.129082 0.173225 -0.010767 -0.001669 -0.010607 -0.012969 -0.014250 -0.024158
polarizability: 2.72279669e+02 1.74572575e+01 2.54920986e+02 6.42396981e+00 1.24281787e+01 2.13043978e+02
1716.lowfreq: -13.2527 -6.1409 -0.0002 0.0002 0.0007 5.7472 7.7394 18.7444 27.8957
frequency: -10.0715 18.6655 27.8527 31.7863 33.4693 44.1551 57.6333 68.9897 70.1801 104.5570 118.9777 132.4900 145.9694 157.0646 167.8930 195.5484 213.1433 220.7086 235.8719 243.5177 254.9916 271.4311 275.6803 297.1637 317.9810 334.6827 353.0121 376.8706 401.0154 403.1937 432.0834 435.4505 476.1449 503.0828 541.8700 564.3730 602.2341 615.3589 616.3771 641.1043 657.4031 701.1135 703.7755 705.6088 740.5325 761.9875 775.1083 792.0823 809.9551 826.4441 853.4221 858.4171 866.1713 876.6715 881.5458 894.3111 923.0290 925.9852 927.2494 945.2722 954.8069 968.0477 978.7068 983.6058 990.1456 990.3366 991.3667 996.7487 998.2741 1003.4239 1018.2549 1030.5585 1032.4053 1069.7078 1084.6574 1089.9852 1094.0871 1099.4362 1121.2677 1121.9041 1141.6084 1144.3586 1156.2816 1159.2789 1170.8274 1173.3802 1188.7950 1188.9216 1196.9519 1197.6575 1202.7873 1204.6538 1235.2765 1238.7471 1271.6638 1286.8213 1300.1832 1307.4367 1316.6155 1323.1683 1325.5121 1347.7110 1363.2285 1372.8885 1378.7728 1383.3158 1385.8143 1425.6312 1434.4441 1435.2564 1453.3132 1455.4341 1464.7779 1466.5989 1471.0208 1477.5722 1480.8360 1481.7633 1484.7814 1487.4764 1495.7053 1589.3259 1592.6663 1595.6580 1610.1741 1614.0941 2834.3270 2853.5363 2940.9214 2974.5208 2984.2552 3008.1484 3011.8536 3013.9157 3014.6883 3034.1564 3069.4142 3073.4307 3080.0693 3084.4737 3089.2125 3089.6097 3109.8058 3119.7787 3124.0355 3128.5550 3133.3858 3141.5151 3146.0939 3157.9708 3159.8429 3174.2821 3180.3546
redmass: 3.6928 4.2953 4.3627 3.8308 3.9955 3.9587 2.9962 3.9275 3.1615 3.1161 2.9405 3.1186 2.4978 2.5950 3.2726 2.5920 3.9784 2.1354 1.8155 1.9179 4.1953 4.5142 2.6266 4.6866 3.0988 4.6141 3.5848 3.9866 2.8378 2.8607 3.5441 3.7038 3.3785 3.8722 3.7868 2.4941 2.3746 6.3994 6.4009 5.7414 6.4084 3.2269 1.9538 2.3884 3.6778 2.0175 2.2320 1.1968 2.6961 2.0649 1.2576 1.2527 4.3410 2.1659 4.7642 1.8669 1.9610 1.7263 2.0326 3.2159 2.1152 4.1936 1.4266 1.3889 4.2260 1.6620 4.9664 1.4194 1.3383 6.7722 2.0546 2.1817 2.0982 2.1889 1.5772 1.6361 1.9674 1.7353 1.2794 1.6330 2.0161 1.6572 1.8676 1.7738 1.0534 1.0530 1.3120 1.7950 1.3153 1.2560 2.4754 2.4426 3.7300 1.4216 1.3057 1.2766 1.3890 1.2867 1.3213 1.4037 1.3281 1.4737 1.5168 1.3847 8.0917 9.3671 1.2502 1.1669 2.2064 2.1267 1.0561 1.0784 1.0886 1.0469 1.0657 1.0896 2.2522 2.1804 1.0548 1.0650 1.0907 6.0249 7.3827 8.4275 5.9474 6.2053 1.0713 1.0716 1.0841 1.0301 1.0354 1.0625 1.0861 1.0658 1.0576 1.0874 1.1037 1.1004 1.0991 1.1068 1.1006 1.1067 1.1024 1.0844 1.0848 1.0885 1.0885 1.0941 1.0941 1.0994 1.0982 1.0967 1.0949
irintensity: 0.1651 0.1448 0.2732 0.1199 0.3278 0.1203 0.1378 0.6549 0.4768 2.1958 1.0335 0.4134 1.3288 0.3693 2.0744 0.4801 1.6244 3.9812 2.7643 0.6175 4.3097 19.8369 5.7935 3.2985 3.7946 3.0419 0.3393 3.6559 0.0563 0.1215 11.9301 11.7235 1.4248 8.7928 3.4476 7.4644 1.8235 0.0361 0.0845 17.5419 16.2488 30.7497 41.0241 39.7815 40.2360 47.3465 27.5589 7.1946 3.3874 3.4337 0.8470 0.1558 24.3344 0.9306 7.0156 1.1934 1.9161 48.1523 5.6826 18.0001 13.7025 114.6499 0.3207 1.1588 3.2284 3.0922 4.8214 8.2190 2.8553 84.7625 10.4845 3.5341 3.7560 26.2789 2.8876 17.0266 6.0593 26.0328 1.8263 1.9074 181.9001 4.1112 109.2019 137.2342 0.3922 0.0149 24.1763 5.6692 5.7875 7.9470 16.6886 59.7334 7.3836 11.3561 4.7949 15.7269 4.7827 1.6819 2.3711 8.3274 1.8026 1.3188 10.0865 0.9402 0.1046 0.3333 24.5053 10.5070 16.4778 8.4365 8.6984 9.8903 9.5426 8.0680 8.6722 6.7209 21.8175 14.8504 10.5294 2.4011 5.0997 1.8773 70.7302 120.0429 0.3815 1.8865 90.8279 140.3130 35.6378 56.8645 31.5351 20.5293 25.8350 39.9479 10.3529 54.8752 32.9927 16.6693 44.5277 30.9454 37.3474 45.2615 19.2867 1.1828 0.2562 6.4139 7.0605 34.0954 25.2168 30.0618 28.4451 9.7279 5.8002
temp: 298.150 k
press: 1.00000 atm
elementType: 8 8 8 7 6 6 6 6 6 6 6 6 6 6 6 6 6 6 6 6 6 6 6 6 6 6 1 1 1 1 1 1 1 1 1 1 1 1 1 1 1 1 1 1 1 1 1 1 1 1 1 1 1
symmnumber: 1
zpe: 1155937.9 jmol-1
zpe.correction: 0.440273 hartree
zpe.thermalcorrener: 0.465071 hartree
zpe.thermalcorrenthalpy: 0.466015 hartree
zpe.thermalcorrgfe: 0.383452 hartree
zpe.sumelectzpe: -1132.995759 hartree
zpe.sumelectthermal: -1132.970962 hartree
zpe.sumelectthermalent: -1132.970017 hartree
zpe.sumelectthermalfe: -1133.052580 hartree
dipole: 1.0835 0.7731 -0.9814
dipole: 1.6538
quadrupole: -137.9490 -152.6577 -146.8736
quadrupole: 5.5416 -0.5050 4.0715
quadrupole: 7.8777 -6.8309 -1.0469 5.5416 -0.5050 4.0715
hfenergy: -1133.4360322 hartree
pointgroup: C01 [X(C22H27N1O3)]
dipole: -0.3913512 0.4414755 0.2743654 debye
polarizability: 270.8431925|-16.7695689|244.5279247|9.1128669|-23.0549885|224.8735167 unknown
InChI: InChI=1S/C22H27NO3/c1-3-23-16-10-15-20(23)17-26-21(24)22(25-2,18-11-6-4-7-12-18)19-13-8-5-9-14-19/h4-9,11-14,20H,3,10,15-17H2,1-2H3
charge 0 multiplicity 1
53 atoms
O  -0.944882 -0.288756 -0.19492
O  1.617398 -0.656946 -2.112596
O  -0.004729 -2.407861 -0.203469
N  -4.630935 -0.351192 0.475899
C  -3.290268 0.252119 0.182824
C  -3.497314 1.137665 -1.077764
C  -4.828752 0.62264 -1.684236
C  -5.64428 0.254119 -0.427888
C  -2.303082 -0.903192 -0.034215
C  -4.995094 -0.429183 1.905145
C  -6.196061 -1.358867 2.160256
C  1.450856 -0.427917 -0.641615
C  0.122683 -1.159906 -0.289639
C  2.672463 -0.959218 0.12932
C  1.323837 1.098323 -0.480139
C  2.605592 -1.905186 1.179647
C  1.052093 1.930464 -1.590985
C  3.940186 -0.439575 -0.247476
C  1.450979 1.678923 0.805646
C  1.95511 -2.029311 -2.531336
C  3.78453 -2.316432 1.846361
C  0.913726 3.326153 -1.417225
C  5.114861 -0.857916 0.408413
C  1.303742 3.071612 0.980182
C  5.041013 -1.798854 1.464065
C  1.034104 3.90274 -0.132277
H  -2.920402 0.869206 1.030584
H  -3.604649 2.19588 -0.77748
H  -2.639435 1.075717 -1.768338
H  -5.335187 1.375753 -2.311725
H  -4.657724 -0.279959 -2.29911
H  -6.460184 -0.458868 -0.642816
H  -6.102351 1.173629 0.018927
H  -2.542108 -1.479364 -0.945792
H  -2.284945 -1.596908 0.825163
H  -5.218838 0.587459 2.323468
H  -4.118171 -0.814934 2.45974
H  -6.400617 -1.436683 3.243846
H  -5.987548 -2.369077 1.765849
H  -7.112285 -0.980942 1.671945
H  1.645272 -2.340135 1.46844
H  0.960776 1.478195 -2.581376
H  3.991144 0.294364 -1.059661
H  1.67424 1.043498 1.670549
H  2.055097 -1.963197 -3.626427
H  1.157559 -2.744861 -2.261161
H  2.910821 -2.36088 -2.084953
H  3.717525 -3.04824 2.659287
H  0.709962 3.962856 -2.286006
H  6.084621 -0.448623 0.103713
H  1.405236 3.508149 1.980374
H  5.952047 -2.12246 1.980044
H  0.925666 4.985285 0.000937
