program: Gaussian 09
title: 000255161
version: EM64L-G09RevD.01
frameworkgroup: C1[X(C12H15NOS)]
method: RPBEPBE
basis: SDD
operation: Freq
keyword: #p
keyword: freq=noraman
keyword: PBEPBE/SDD
title: #p freq=noraman PBEPBE/SDD
converged: YES YES NO NO
title: Mulliken charges:
elementType: S O N C C C C C C C C C C C C H H H H H H H H H H H H H H H
charge: 0.289695 -0.218962 -0.020185 -0.133478 -0.425369 -0.392915 0.244487 -0.429653 -0.698335 -0.266482 -0.267433 -0.038124 -0.268118 -0.155301 -0.754179 0.199508 0.252254 0.225517 0.206291 0.233170 0.271764 0.238017 0.223916 0.233881 0.202207 0.252749 0.258069 0.247899 0.248117 0.240992
chargesum: 0.00000
title: Mulliken charges with hydrogens summed into heavy atoms:
elementType: S O N C C C C C C C C C C C C
charge: 0.289695 -0.218962 -0.020185 0.066030 0.052402 0.046546 0.244487 0.080127 -0.038331 -0.266482 -0.014684 -0.038124 -0.010049 -0.155301 -0.017170
polarizability: 2.10455696e+02 -1.47367005e+01 1.24430583e+02 -1.14213044e+01 -3.27107295e+00 1.32847995e+02
1716.lowfreq: -6.5663 -0.0012 -0.0010 -0.0004 7.4039 8.1122 17.8017 37.8884 54.9877
frequency: 17.4948 37.8738 54.9794 79.0133 85.2759 91.6116 94.6652 112.6730 132.2008 174.2539 176.2794 234.1185 268.8533 277.5400 303.4164 308.6938 361.1286 375.0054 405.4642 442.0887 471.1385 547.4106 566.0406 580.0810 628.0858 674.1555 698.2227 720.6217 768.7840 809.5925 814.5677 856.3694 906.0461 908.5729 942.2791 970.5900 998.6168 1002.6875 1038.2829 1053.7788 1070.5823 1072.4957 1099.4672 1113.7952 1163.8330 1176.8177 1205.6471 1235.9053 1251.0241 1263.6994 1282.4917 1295.4242 1321.9014 1326.2552 1340.7813 1362.0498 1394.9505 1401.7961 1446.2892 1458.0396 1458.8144 1463.9385 1467.7816 1478.7399 1480.6743 1500.4803 1537.1645 1563.6119 2198.1353 2978.0870 2982.3686 2983.3516 2986.3230 2997.5339 3008.5471 3039.7621 3042.0065 3061.1023 3073.1993 3080.0182 3082.0855 3092.4691 3168.8794 3188.8493
redmass: 6.0552 4.9763 3.8456 2.3660 1.2777 3.0730 2.3363 4.8036 4.4849 2.3862 4.2125 1.4850 3.4426 3.4664 3.2925 3.8242 4.4570 3.5932 3.6880 7.5828 4.8866 5.1702 3.0527 4.2495 5.0918 3.0352 5.1029 2.7441 1.4729 1.8155 1.2972 2.5567 2.4072 1.6919 2.5085 1.7451 1.7637 2.9368 1.4358 2.3944 2.0860 1.5633 1.9401 2.2751 2.7727 1.5174 1.9318 1.2936 1.7560 1.2430 1.2101 1.2552 1.7045 2.1675 1.3958 1.5747 1.2100 1.2229 1.0806 1.0431 1.0875 1.1883 1.1046 1.0502 1.0510 5.0247 5.4114 6.1328 12.4348 1.0363 1.0369 1.0604 1.0590 1.0825 1.0606 1.0999 1.1001 1.0977 1.0999 1.1028 1.1008 1.0989 1.0905 1.0997
irintensity: 1.4122 0.7719 3.7969 2.9231 2.3056 2.9785 0.2429 0.0710 4.4840 1.1522 3.0631 2.2659 2.2515 1.5569 1.0391 5.9005 0.9155 1.1286 2.0030 3.0027 9.9024 13.6774 0.4700 1.6616 1.4722 0.2682 2.0872 7.1813 6.1375 39.0969 41.5061 9.1672 9.6421 2.7455 1.5819 8.7493 0.4015 2.7233 6.5346 1.5530 7.8240 27.3008 4.7806 16.9519 16.1443 5.5978 3.5039 15.7448 81.3766 19.5882 9.0939 8.4154 7.5218 2.6585 5.6794 5.4126 8.8999 11.1268 1.4643 17.8383 5.2345 40.6005 29.5195 11.1147 13.4255 197.3548 80.6415 84.2290 17.4268 28.9939 24.8075 25.3680 5.2517 15.1825 35.4917 5.2397 0.0960 11.7703 36.3609 17.7894 61.0055 12.5574 9.5568 3.6694
temp: 298.150 k
press: 1.00000 atm
elementType: 16 8 7 6 6 6 6 6 6 6 6 6 6 6 6 1 1 1 1 1 1 1 1 1 1 1 1 1 1 1
symmnumber: 1
zpe: 629150.3 jmol-1
zpe.correction: 0.239631 hartree
zpe.thermalcorrener: 0.256410 hartree
zpe.thermalcorrenthalpy: 0.257354 hartree
zpe.thermalcorrgfe: 0.192920 hartree
zpe.sumelectzpe: -993.169631 hartree
zpe.sumelectthermal: -993.152851 hartree
zpe.sumelectthermalent: -993.151907 hartree
zpe.sumelectthermalfe: -993.216342 hartree
dipole: 6.0969 2.3174 -3.9820
dipole: 7.6419
quadrupole: -107.5322 -102.6457 -98.8169
quadrupole: -21.7501 -0.4300 -1.1048
quadrupole: -4.5339 0.3526 4.1813 -21.7501 -0.4300 -1.1048
hfenergy: -993.4092615 hartree
pointgroup: C01 [X(C12H15N1O1S1)]
dipole: -2.4928166 -0.5933334 -1.5726392 debye
polarizability: 208.7738479|-20.9526716|126.0930998|7.4323444|2.4050469|132.8673264 unknown
InChI: InChI=1S/C12H15NOS/c1-3-10(5-4-8-13)12(14)11-7-6-9(2)15-11/h6-7,10H,3-5H2,1-2H3
charge 0 multiplicity 1
30 atoms
S  -2.376412 0.518718 1.306861
O  0.371966 -0.609206 1.877608
N  4.91505 2.282211 0.019826
C  1.210697 -1.079529 -0.359208
C  2.569969 -0.392578 -0.057961
C  1.351728 -2.626131 -0.212095
C  0.139198 -0.570006 0.62548
C  2.517122 1.149199 -0.253592
C  0.096837 -3.416719 -0.638178
C  -1.133262 -0.056756 0.110651
C  -1.610884 0.082934 -1.197252
C  -3.5000 0.928979 -0.041463
C  -2.93106 0.632873 -1.280448
C  3.837781 1.782787 -0.100931
C  -4.853192 1.512641 0.24981
H  0.913206 -0.851563 -1.40134
H  2.858033 -0.616738 0.984736
H  3.343065 -0.821454 -0.722224
H  2.218546 -2.949824 -0.821569
H  1.596922 -2.846544 0.844613
H  1.823843 1.599657 0.4820
H  2.126365 1.395086 -1.260807
H  0.271794 -4.503675 -0.544918
H  -0.776677 -3.163148 -0.010771
H  -0.172194 -3.208984 -1.691457
H  -1.030001 -0.206093 -2.076128
H  -3.455151 0.809558 -2.22309
H  -5.467656 0.832532 0.868482
H  -4.776393 2.471743 0.794784
H  -5.396739 1.699633 -0.691821
