program: Gaussian 09
title: 000018165
version: EM64L-G09RevD.01
frameworkgroup: C1[X(C10H16N2)]
method: RPBEPBE
basis: SDD
operation: Freq
keyword: #pfreq=noraman
keyword: PBEPBE/SDD
title: #p freq=noraman PBEPBE/SDD
converged: YES YES NO NO
title: Mulliken charges:
elementType: N N C C C C C C C C C C H H H H H H H H H H H H H H H H
charge: -0.429098 -0.429093 0.473804 0.473804 -0.361449 -0.440462 -0.440462 -0.361445 -0.313512 -0.313515 -0.727111 -0.727103 0.230118 0.204421 0.204418 0.230116 0.286574 0.286569 0.205768 0.206134 0.205746 0.206153 0.225021 0.220505 0.219289 0.220553 0.219238 0.225019
chargesum: 0.00000
title: Mulliken charges with hydrogens summed into heavy atoms:
elementType: N N C C C C C C C C C C
charge: -0.142524 -0.142524 0.473804 0.473804 -0.131331 -0.236042 -0.236044 -0.131329 0.098390 0.098384 -0.062296 -0.062292
polarizability: 2.04084100e+02 -6.60965002e-01 1.17778113e+02 4.98419516e-03 -9.46116429e-04 7.10547161e+01
1716.lowfreq: -71.5873 -59.7814 -10.3661 -10.0296 -0.0011 -0.0005 -0.0004 9.2518 30.4778
frequency: -70.6478 -59.7811 30.4771 58.7259 96.8714 152.5745 164.4387 184.3615 190.4930 258.4833 259.0096 266.6937 338.3317 352.9397 406.9298 421.0002 434.9327 509.3756 595.2493 637.9854 705.4435 776.2358 784.8847 796.9739 818.1851 819.0712 831.3684 900.7707 918.3330 929.2148 934.4025 990.4086 1067.9273 1069.5292 1116.1779 1148.1838 1148.3007 1165.1056 1176.2358 1194.2527 1258.7595 1258.8001 1272.0865 1292.6580 1328.8998 1333.6385 1358.3500 1371.2432 1391.0866 1391.5866 1425.0359 1453.8687 1474.5677 1474.5771 1480.3800 1484.2920 1492.4450 1504.6238 1507.6853 1533.8134 1584.5757 1656.4642 2909.3005 2910.6813 2939.7782 2939.8608 2980.0769 2980.1920 3072.7727 3072.8215 3089.9220 3089.9540 3104.5099 3105.8057 3149.5209 3153.7991 3579.7042 3580.5105
redmass: 1.8791 1.7971 3.1529 3.2409 3.4354 6.4555 3.4251 1.0399 1.1636 1.1301 1.1382 3.6368 2.9205 6.4102 2.9989 4.6692 3.2426 2.1069 4.9930 6.9327 3.4671 3.3846 1.2442 1.6172 1.1038 1.1877 4.0440 1.3835 1.3365 2.0054 2.0830 2.6040 2.5891 2.4705 1.5632 1.4894 1.4898 2.6780 2.1771 1.1523 1.1103 1.1097 1.7811 1.4098 1.8397 2.0403 1.6835 1.8615 1.2531 1.2442 3.4962 1.7538 1.0415 1.0413 1.1348 1.0600 1.5181 1.1371 1.0804 2.9349 4.7372 6.7808 1.0571 1.0572 1.1038 1.1037 1.0360 1.0361 1.1005 1.1005 1.0987 1.0987 1.0883 1.0884 1.0928 1.0940 1.0770 1.0772
irintensity: 0.1021 76.8504 0.0567 0.0006 0.7212 11.2681 0.0023 118.0399 0.1289 3.3725 0.0127 0.0027 2.3158 0.0005 2.2789 5.8065 0.0066 24.9889 0.0001 0.0009 0.0009 26.9618 0.0464 104.8083 0.0009 3.4058 0.0028 0.0002 0.4251 0.0001 4.9440 0.6053 0.0001 1.3584 11.1953 0.0314 3.0859 0.0000 69.3507 0.0002 0.6563 0.0448 142.1601 0.0005 0.0000 101.8880 0.0001 96.4342 70.4783 0.0101 21.1082 0.0040 0.0254 24.5718 66.4191 0.0092 3.0916 186.7570 0.0000 563.8467 0.0000 0.0006 175.4467 0.8945 2.6534 107.7584 74.8289 0.0083 0.3232 95.6536 72.8285 0.3696 60.0488 0.0019 48.4337 0.0001 54.3305 0.0003
temp: 298.150 k
press: 1.00000 atm
elementType: 7 7 6 6 6 6 6 6 6 6 6 6 1 1 1 1 1 1 1 1 1 1 1 1 1 1 1 1
symmnumber: 1
zpe: 631858.7 jmol-1
zpe.correction: 0.240662 hartree
zpe.thermalcorrener: 0.253032 hartree
zpe.thermalcorrenthalpy: 0.253976 hartree
zpe.thermalcorrgfe: 0.201619 hartree
zpe.sumelectzpe: -499.238314 hartree
zpe.sumelectthermal: -499.225945 hartree
zpe.sumelectthermalent: -499.225001 hartree
zpe.sumelectthermalfe: -499.277357 hartree
dipole: 0.0001 0.0000 -0.0161
dipole: 0.0161
quadrupole: -53.5381 -66.2719 -79.5333
quadrupole: -2.2741 0.0070 -0.0043
quadrupole: 12.9097 0.1758 -13.0855 -2.2741 0.0070 -0.0043
hfenergy: -499.4789767 hartree
pointgroup: C01 [X(C10H16N2)]
dipole: -0.0000341 -0.0000153 0.0063328 debye
polarizability: 204.0842668|0.6499876|117.7779437|0.0008825|0.0113583|71.0547187 unknown
InChI: InChI=1S/C10H16N2/c1-3-11-9-5-7-10(8-6-9)12-4-2/h5-8,11-12H,3-4H2,1-2H3
charge 0 multiplicity 1
28 atoms
N  -2.801003 -0.514953 0.002278
N  2.801005 0.515076 0.00247
C  -1.421705 -0.25032 0.004441
C  1.421705 0.250438 0.004594
C  -0.907882 1.079633 0.005957
C  0.480566 1.318544 0.005431
C  -0.480564 -1.318424 0.00483
C  0.907881 -1.079513 0.00549
C  -3.829124 0.522476 0.000156
C  3.829127 -0.522348 0.000007
C  -5.234666 -0.103749 -0.021701
C  5.234661 0.103874 -0.022399
H  -1.591391 1.934814 0.007848
H  0.843313 2.355394 0.005679
H  -0.843313 -2.355275 0.004684
H  1.59139 -1.934696 0.007071
H  -3.103262 -1.487454 0.011111
H  3.103262 1.48756 0.013031
H  -3.729883 1.173572 0.89812
H  -3.70826 1.186769 -0.884934
H  3.730282 -1.173537 0.89797
H  3.70788 -1.186555 -0.885074
H  -6.008934 0.683041 -0.022396
H  -5.377259 -0.723626 -0.926468
H  -5.397969 -0.740963 0.867575
H  5.376881 0.723767 -0.927207
H  5.398336 0.741072 0.866828
H  6.008926 -0.682918 -0.02339
