program: Gaussian 09
title: 000255156
version: EM64L-G09RevD.01
frameworkgroup: C1[X(C12H8Cl2OS2)]
method: RPBEPBE
basis: SDD
operation: Freq
keyword: #p
keyword: freq=noraman
keyword: PBEPBE/SDD
title: #p freq=noraman PBEPBE/SDD
converged: YES YES NO NO
title: Mulliken charges:
elementType: Cl Cl S S O C C C C C C C C C C C C H H H H H H H H
charge: 0.028012 0.023684 0.279297 0.381715 -0.259948 0.510184 -0.228793 -0.395858 -0.832180 0.255407 -0.260467 -0.268851 -0.062212 -0.253616 -0.439878 -0.066988 -0.455951 0.198104 0.231918 0.231077 0.320771 0.270957 0.269047 0.254231 0.270338
chargesum: 0.00000
title: Mulliken charges with hydrogens summed into heavy atoms:
elementType: Cl Cl S S O C C C C C C C C C C C C
charge: 0.028012 0.023684 0.279297 0.381715 -0.259948 0.510184 -0.228793 -0.197754 -0.048414 0.255407 -0.260467 0.002106 0.206835 0.000615 -0.439878 0.203350 -0.455951
polarizability: 4.14423433e+02 -9.56729719e+00 2.06556437e+02 -1.12927996e-02 -2.21056765e-01 7.00408566e+01
1716.lowfreq: -8.9036 -5.0139 -0.7598 -0.0031 -0.0029 -0.0020 21.1537 30.4990 41.3241
frequency: 21.1477 30.4749 41.3233 53.7423 77.5466 105.9386 114.0788 137.7090 148.5539 183.2158 229.6017 248.1972 260.9368 275.4023 284.0365 311.8321 383.1685 415.0156 428.4137 431.4892 458.3444 505.8542 527.6835 550.3096 582.3884 584.1106 638.7492 639.5581 677.1738 695.2131 707.9373 799.8259 803.7178 809.7485 874.1104 881.0363 896.7766 898.8061 943.9821 955.7202 1003.7931 1042.5737 1046.9008 1086.9717 1088.9780 1196.6536 1205.2064 1227.2335 1269.6088 1309.2150 1324.0508 1386.9314 1394.0843 1447.3518 1456.0666 1472.5747 1494.7386 1507.6696 1535.1108 1541.3932 1603.2079 2979.9752 3057.5107 3116.4438 3124.4326 3176.8205 3184.6756 3201.2711 3205.5120
redmass: 6.3948 7.1159 13.3350 5.1987 6.0517 15.1575 13.3705 1.0990 4.9544 13.6016 9.5655 7.2145 9.5040 6.9954 6.0038 5.5344 8.8425 7.1618 8.8190 5.9058 6.3329 7.0871 2.9900 3.1165 7.1345 2.8140 9.5483 8.5096 6.8432 7.1395 3.7234 1.3085 1.2540 5.3497 1.6828 4.5239 1.4377 1.4235 4.4082 5.0854 4.8766 1.6828 1.5016 1.6300 1.6359 1.8882 1.4442 1.9078 3.3098 3.4239 4.1462 1.2116 1.7397 1.4385 7.9187 4.1461 1.0479 5.0205 5.3613 5.4648 5.2719 1.0384 1.0967 1.0878 1.0983 1.0917 1.0913 1.0998 1.0998
irintensity: 4.1201 0.0058 0.1063 0.0092 0.0040 0.9120 1.4377 2.0571 0.4954 0.1094 2.7969 0.4937 1.5065 1.7601 0.0881 13.8737 3.5042 36.1681 0.7256 2.9970 27.9040 18.0510 0.1771 0.0311 2.6991 1.4274 9.6542 8.1560 0.8382 2.6647 4.7510 70.0015 49.8626 59.4880 33.8975 15.0479 0.0119 0.4777 63.5099 56.6980 82.3198 0.5908 1.6907 4.2149 43.8767 22.5665 14.2060 175.0306 38.5127 50.9441 41.9400 47.8634 36.9334 257.1350 588.2863 64.0234 19.6714 47.3430 33.5525 35.2668 544.1069 32.6927 14.2194 14.8756 7.0528 5.9725 2.9461 0.9423 0.5078
temp: 298.150 k
press: 1.00000 atm
elementType: 17 17 16 16 8 6 6 6 6 6 6 6 6 6 6 6 6 1 1 1 1 1 1 1 1
symmnumber: 1
zpe: 426467.7 jmol-1
zpe.correction: 0.162433 hartree
zpe.thermalcorrener: 0.179454 hartree
zpe.thermalcorrenthalpy: 0.180398 hartree
zpe.thermalcorrgfe: 0.114198 hartree
zpe.sumelectzpe: -2252.288519 hartree
zpe.sumelectthermal: -2252.271498 hartree
zpe.sumelectthermalent: -2252.270554 hartree
zpe.sumelectthermalfe: -2252.336754 hartree
dipole: -3.4278 -1.3731 0.0069
dipole: 3.6926
quadrupole: -123.3393 -123.7683 -131.1778
quadrupole: -16.8182 0.0514 -0.0466
quadrupole: 2.7559 2.3268 -5.0827 -16.8182 0.0514 -0.0466
hfenergy: -2252.4509518 hartree
pointgroup: C01 [X(C12H8Cl2O1S2)]
dipole: 1.2925593 -0.6470708 -0.1455704 debye
dipolederiv: -0.4769123 0.328208 0.0837887 0.6311151 -0.5265968 -0.1585906 0.1977383 -0.1825034 -0.0278902 -1.0791374 -0.1526173 -0.1433876 -0.1105534 -0.0743871 -0.044941 -0.1273828 -0.0481806 -0.0082276 -0.1351693 -0.0747933 -0.0530428 -0.0418473 -0.2042608 -0.1405939 -0.0378224 -0.1437217 0.1001406 -0.0183787 0.0519543 0.0028622 0.1372131 -0.0668506 -0.0948376 0.0365858 -0.1006736 0.1705975 -1.027324 0.0396335 -0.0413834 0.1630382 -0.9113024 -0.2120673 0.0039732 -0.2220896 -0.3992199 1.5380993 -0.2989536 0.0034894 0.1145439 0.3660068 0.1192565 0.1632961 0.0872573 0.117194 -0.7952629 0.298868 0.0648845 0.0926812 0.1618311 0.1405041 -0.0185363 0.1562385 -0.1267973 -1.9941821 0.2299253 -0.054979 -0.1834719 -0.1006322 0.0235286 -0.2077701 0.0576516 -0.2022644 -0.2302474 0.0019273 -0.0234553 0.0364425 -0.2289201 -0.1053905 -0.0160063 -0.1099124 0.015472 2.709307 0.1313504 0.2497113 0.0999002 0.9444397 0.2876358 0.241629 0.2912362 0.3338691 -0.4891124 -0.4910789 -0.2140081 -1.1765414 -0.2771114 -0.1308776 -0.4789284 -0.0785976 -0.2394154 0.4597547 -0.2804183 -0.0600331 -0.1751695 0.0153098 0.0385585 -0.0199407 0.0303234 -0.1128199 -0.1424069 0.0901381 0.0309132 0.6237422 -0.4976569 -0.1009959 0.2345971 -0.1431145 -0.1370197 0.3362591 0.0880656 0.0672861 0.6345495 -0.0008078 0.0878554 0.2754106 0.0451178 -0.0615849 0.4047408 -0.2160583 -0.0312065 -0.865808 0.8394894 0.3250755 -0.2789928 0.3768433 -0.0797946 -0.9975769 -0.0079062 -0.0707984 0.2529285 -0.0623327 0.0414448 0.031706 0.0213214 -0.1081874 1.4502268 0.2072153 0.2069285 -0.3297984 0.2678622 0.1573511 0.000451 0.1986954 -0.130729 0.0949505 -0.0058698 -0.0066746 0.0644055 -0.0729592 -0.0789762 0.0188945 -0.0849165 0.124396 0.0326033 -0.0171497 -0.1163554 0.0006862 0.0742937 0.027266 -0.1070936 -0.0107763 -0.0543569 -0.0039248 -0.1015047 0.0815849 -0.0748442 0.0376564 0.0277469 0.090675 0.0630805 0.0192565 0.1529764 0.1478681 0.0554965 0.053154 0.1096538 0.0007043 0.0210785 0.0079533 0.1254045 0.14995 -0.0198205 -0.0098522 -0.0082356 -0.0087781 -0.0714331 -0.0054799 -0.0724094 0.1494414 -0.0280357 -0.0030006 -0.0198544 -0.0161611 0.1232922 -0.03061 -0.0247619 -0.0294386 0.1870924 0.0052223 0.0717289 0.0141401 0.1323005 0.0801687 -0.0296086 0.0368848 -0.0342259 0.1727626 0.0835807 -0.0177117 -0.0160546 -0.0542699 0.0125923 -0.0780049 -0.0302046 -0.0751584 0.1726807 unknown
polarizability: 412.6211261|-17.170894|189.9280767|20.5726122|44.2097648|88.471523 unknown
InChI: InChI=1S/C12H8Cl2OS2/c1-7(9-2-4-11(13)16-9)6-8(15)10-3-5-12(14)17-10/h2-6H,1H3
charge 0 multiplicity 1
25 atoms
Cl 5.208598 -3.021381 -0.494477
Cl -6.628365 -0.924757 -0.636541
S  2.482353 -1.582137 -0.171955
S  -4.165099 0.762995 0.201261
O  -1.618454 2.06378 0.887263
C  1.188035 0.867234 0.652733
C  2.43842 0.131674 0.475627
C  -0.02726 0.28152 0.340887
C  1.326733 2.281583 1.190945
C  -1.372061 0.878809 0.458629
C  -2.509016 0.026574 0.045149
C  3.73953 0.566261 0.746955
C  4.775396 -0.387581 0.470106
C  -2.582452 -1.27375 -0.46164
C  4.272583 -1.578885 -0.02362
C  -3.914514 -1.728223 -0.739033
C  -4.86305 -0.760991 -0.438692
H  -0.011007 -0.747818 -0.039518
H  1.808578 2.270698 2.18693
H  1.962998 2.890315 0.521479
H  0.339404 2.754308 1.277551
H  3.950673 1.56186 1.142415
H  5.838981 -0.202257 0.627908
H  -1.705739 -1.901239 -0.6375
H  -4.159065 -2.714094 -1.138061
