program: Gaussian 09
title: 000255137
version: EM64L-G09RevD.01
frameworkgroup: C1[X(C12H16O2S)]
method: RPBEPBE
basis: SDD
operation: Freq
keyword: #p
keyword: freq=noraman
keyword: PBEPBE/SDD
title: #p freq=noraman PBEPBE/SDD
converged: YES YES NO NO
title: Mulliken charges:
elementType: S O O C C C C C C C C C C C C H H H H H H H H H H H H H H H H
charge: 0.335497 -0.203425 -0.214069 -0.364359 -0.341699 -0.510787 -0.356637 0.220172 -0.618303 -0.695378 0.271974 -0.275724 -0.250370 -0.147295 -0.512686 0.215085 0.208326 0.189960 0.182910 0.238491 0.266280 0.196943 0.197661 0.259662 0.249381 0.209238 0.210796 0.217064 0.295866 0.253813 0.271614
chargesum: 0.00000
title: Mulliken charges with hydrogens summed into heavy atoms:
elementType: S O O C C C C C C C C C C C C
charge: 0.335497 -0.203425 -0.214069 0.059051 0.031171 -0.006016 0.037968 0.220172 -0.109259 -0.058281 0.271974 -0.275724 0.045495 0.106518 -0.241073
polarizability: 1.84385374e+02 1.45841443e+01 1.33706806e+02 2.74893678e+01 -1.40508387e+01 1.39536344e+02
1716.lowfreq: -0.0024 -0.0021 -0.0021 3.3732 8.2831 15.9215 19.2567 32.8373 45.3601
frequency: 17.7125 32.4214 45.0956 63.5124 66.8358 91.6601 108.4387 119.5881 139.2555 163.4087 178.1655 219.5320 238.5397 266.4936 338.3172 392.4312 423.1278 437.6405 455.9904 498.4031 540.8273 570.4662 604.4411 642.2812 695.3174 707.2310 726.8531 728.1802 759.6829 818.6377 827.6257 847.1853 857.5011 901.3259 913.7046 928.8228 940.1541 960.5772 1014.9424 1055.1697 1069.6670 1074.9121 1084.4804 1092.7394 1097.8405 1121.5225 1170.8981 1193.6918 1230.3179 1233.4307 1248.1784 1258.0202 1281.3719 1288.4244 1292.7159 1313.0844 1345.7046 1354.9048 1364.0807 1391.0330 1427.3631 1450.2830 1452.9373 1464.0082 1468.4981 1478.7429 1479.1807 1487.8397 1520.1017 1570.9199 1626.0353 2951.8199 2953.7444 2968.9110 2972.7398 2990.8750 2993.1306 2997.2869 3023.4150 3035.2791 3054.4225 3069.2603 3072.0433 3112.3552 3173.7888 3190.5781 3232.5655
redmass: 5.4352 5.9484 1.7703 4.4596 4.7310 4.1388 3.4917 1.8991 2.9738 4.8085 5.8454 3.9659 1.1176 6.3375 3.6763 2.9266 5.6273 3.7512 4.3783 3.3419 3.8609 3.1982 3.3893 7.4829 6.0776 2.1059 1.1877 1.2761 1.4461 2.5330 3.7710 1.4794 1.6196 1.8527 3.0858 1.4849 2.1304 1.4823 3.3429 2.2593 1.9217 1.8091 1.9385 1.3774 1.3310 2.4356 1.8502 1.5678 1.5132 1.3751 1.3693 1.2898 2.2916 1.0662 1.1171 1.4879 2.4074 1.6156 1.7390 1.2185 1.0983 1.6703 2.1126 1.0707 1.0734 1.0698 1.0419 1.0858 5.4854 9.1207 8.0805 1.0618 1.0594 1.0583 1.0372 1.0637 1.0929 1.0968 1.1027 1.0572 1.1031 1.1008 1.0993 1.1061 1.0912 1.0971 1.1002
irintensity: 0.7910 3.5345 0.0271 0.1948 6.0153 2.3022 2.5020 0.1565 1.1526 3.9180 2.1220 4.5704 0.0127 0.1372 0.4065 0.8352 2.4350 9.8252 3.5453 1.2165 6.8411 6.8170 23.3528 2.6404 8.5811 3.2136 62.5431 43.6193 1.9556 7.3079 14.0921 8.4162 3.9508 10.5130 62.0513 13.4125 5.5691 0.9755 14.4416 28.3622 28.6415 22.6052 1.8543 48.3046 10.5274 21.2266 147.4786 4.1694 34.5699 43.9940 42.6692 20.6960 66.7253 0.0704 1.2144 24.7744 11.0380 6.1570 22.7869 9.6289 30.0632 42.4693 68.1972 0.1166 0.7440 5.4437 12.6014 19.1589 31.6574 237.1677 64.4396 7.5935 18.0408 53.9746 32.8287 28.8387 6.1597 0.3674 15.7326 4.7210 38.2115 98.5873 52.1716 6.4696 2.4225 4.3567 0.4929
temp: 298.150 k
press: 1.00000 atm
elementType: 16 8 8 6 6 6 6 6 6 6 6 6 6 6 6 1 1 1 1 1 1 1 1 1 1 1 1 1 1 1 1
symmnumber: 1
zpe: 658320.8 jmol-1
zpe.correction: 0.250741 hartree
zpe.thermalcorrener: 0.267236 hartree
zpe.thermalcorrenthalpy: 0.268180 hartree
zpe.thermalcorrgfe: 0.203569 hartree
zpe.sumelectzpe: -1014.228582 hartree
zpe.sumelectthermal: -1014.212086 hartree
zpe.sumelectthermalent: -1014.211142 hartree
zpe.sumelectthermalfe: -1014.275754 hartree
dipole: -0.5344 1.1699 -0.9402
dipole: 1.5932
quadrupole: -84.4207 -99.8097 -99.4088
quadrupole: -1.3895 11.0575 8.4717
quadrupole: 10.1257 -5.2633 -4.8624 -1.3895 11.0575 8.4717
hfenergy: -1014.4793227 hartree
pointgroup: C01 [X(C12H16O2S1)]
dipole: -0.2353609 -0.5577921 0.1623823 debye
polarizability: 185.0705978|-4.3941737|144.7770057|-30.5337876|-10.8335517|127.7809202 unknown
InChI: InChI=1S/C12H16O2S/c1-2-3-4-6-10(13)9-11(14)12-7-5-8-15-12/h5,7-8H,2-4,6,9H2,1H3
charge 0 multiplicity 1
31 atoms
S  -3.516563 1.834998 0.089818
O  0.271142 -1.806366 -0.45752
O  -1.190659 2.002537 -1.911709
C  2.74199 -0.345092 -0.178009
C  4.03989 0.483104 -0.298893
C  1.740376 -0.035089 -1.305547
C  5.049641 0.184775 0.833037
C  0.44702 -0.835008 -1.239754
C  -0.683054 -0.373497 -2.185733
C  6.341568 1.022554 0.724098
C  -1.464411 0.810459 -1.572154
C  -2.497379 0.49139 -0.583166
C  -2.839407 -0.736544 -0.005157
C  -3.896149 -0.641625 0.95911
C  -4.369945 0.657005 1.121302
H  2.979709 -1.426014 -0.185721
H  2.261229 -0.147218 0.800028
H  3.79289 1.565456 -0.291188
H  4.522169 0.281387 -1.278888
H  2.202207 -0.233008 -2.297953
H  1.473856 1.042689 -1.330314
H  5.303673 -0.89475 0.818889
H  4.564264 0.376135 1.811755
H  -1.351742 -1.227475 -2.378757
H  -0.255829 -0.003663 -3.132685
H  6.86316 0.826918 -0.232059
H  6.116627 2.105007 0.767081
H  7.044442 0.790563 1.545193
H  -2.313922 -1.664986 -0.243235
H  -4.290178 -1.49599 1.513691
H  -5.165815 1.008045 1.776941
