program: Gaussian 09
title: 000255135
version: EM64L-G09RevD.01
frameworkgroup: C1[X(C9H10O2S)]
method: RPBEPBE
basis: SDD
operation: Freq
keyword: #p
keyword: freq=noraman
keyword: PBEPBE/SDD
title: #p freq=noraman PBEPBE/SDD
converged: YES YES NO NO
title: Mulliken charges:
elementType: S O O C C C C C C C C C H H H H H H H H H H
charge: 0.336768 -0.208501 -0.214139 -0.612651 -0.471162 0.247867 0.267378 -0.271087 -0.673116 -0.248338 -0.146020 -0.511960 0.248712 0.260605 0.264857 0.235376 0.215314 0.232064 0.227591 0.294709 0.253932 0.271800
chargesum: 0.00000
title: Mulliken charges with hydrogens summed into heavy atoms:
elementType: S O O C C C C C C C C C
charge: 0.336768 -0.208501 -0.214139 -0.103333 0.029071 0.247867 0.267378 -0.271087 0.001854 0.046370 0.107912 -0.240160
polarizability: 1.53733529e+02 1.18362405e+01 1.25579319e+02 -1.45697932e+01 4.87881581e+00 7.70957384e+01
1716.lowfreq: -8.6684 -7.0850 0.0006 0.0026 0.0028 7.9718 30.5013 41.7956 61.4988
frequency: 30.4449 41.7763 61.4906 72.8477 127.3247 163.8430 170.8559 190.1377 231.0619 307.5550 402.2819 422.2829 447.6880 494.2725 536.2719 568.0970 599.6156 642.1685 690.6001 705.7113 726.8961 760.6825 813.9361 828.3347 851.9535 913.4219 927.5470 944.1119 1003.2037 1049.0719 1065.8267 1071.0546 1092.3030 1103.9789 1170.8530 1219.6964 1228.7009 1255.0335 1280.8969 1340.4477 1346.0081 1396.4817 1430.9680 1450.4955 1453.0114 1470.6312 1479.3664 1519.3412 1571.2496 1629.2341 2964.2913 2998.7661 3008.8768 3037.0902 3095.6412 3100.8016 3114.3632 3173.7467 3190.6055 3232.5910
redmass: 4.7915 4.4921 5.2683 2.2290 4.7407 4.7067 2.6866 1.6619 3.6132 6.1405 2.5734 5.8875 5.3561 3.6196 3.8103 3.1115 3.3365 7.2929 5.2498 4.1117 1.1819 2.1029 2.3805 3.2297 1.4012 3.0188 1.5221 2.4632 1.8157 1.8235 1.6940 1.7413 1.2226 1.9098 1.8866 1.2768 1.4940 1.3085 2.4373 1.9461 2.3459 1.2100 1.0979 2.3414 1.5468 1.0398 1.0510 5.5470 9.1229 7.8881 1.0623 1.0361 1.0958 1.0571 1.1005 1.1000 1.1060 1.0912 1.0971 1.1002
irintensity: 3.1477 3.3789 6.1999 1.1096 1.4609 2.2216 2.4400 0.3048 7.6590 2.1600 5.1012 2.6338 1.8391 0.3148 7.3697 6.5633 24.1588 2.5282 5.2606 6.3030 97.6075 2.8006 4.5338 17.3775 9.6195 59.6574 15.1686 6.5657 26.3426 33.8066 30.3124 30.8182 14.7139 49.9450 153.4223 35.2239 6.9664 44.7160 73.1714 44.2396 5.2405 20.0231 33.1191 59.0662 52.8751 12.9585 12.0436 30.8445 240.3806 65.6367 15.2354 24.9552 2.7112 5.4307 29.7742 23.6983 6.3120 2.3136 4.0046 0.4678
temp: 298.150 k
press: 1.00000 atm
elementType: 16 8 8 6 6 6 6 6 6 6 6 6 1 1 1 1 1 1 1 1 1 1
symmnumber: 1
zpe: 437939.9 jmol-1
zpe.correction: 0.166803 hartree
zpe.thermalcorrener: 0.179230 hartree
zpe.thermalcorrenthalpy: 0.180174 hartree
zpe.thermalcorrgfe: 0.126084 hartree
zpe.sumelectzpe: -896.559557 hartree
zpe.sumelectthermal: -896.547129 hartree
zpe.sumelectthermalent: -896.546185 hartree
zpe.sumelectthermalfe: -896.600275 hartree
dipole: -0.4776 -1.3894 -0.7188
dipole: 1.6356
quadrupole: -64.2532 -87.2573 -75.7516
quadrupole: 9.8338 -3.2603 -0.2164
quadrupole: 11.5008 -11.5033 0.0025 9.8338 -3.2603 -0.2164
hfenergy: -896.7263592 hartree
pointgroup: C01 [X(C9H10O2S1)]
dipole: 0.2757616 -0.2552731 -0.5223864 debye
dipolederiv: 0.1099054 -0.0458852 0.0137374 -0.0552241 0.0901923 -0.1108679 -0.0577517 -0.1452368 -0.1714826 -0.5623418 0.0816868 0.0524205 0.2247052 -0.3265636 0.0720406 -0.2293094 -0.0124511 -0.8754986 -0.6388704 -0.1192188 0.1464586 -0.147126 -0.3619924 -0.182373 0.2290674 0.0354229 -0.9601429 -0.8862573 -0.0753834 -0.4504125 -0.0481111 -0.120151 -0.0212648 -0.56811 -0.0375148 -0.2784954 -0.2422495 0.1431306 0.1326216 0.1604605 0.0876109 -0.0081691 0.2096831 -0.0628959 -0.1238553 1.1243257 -0.3194357 0.0348363 -0.7716667 0.1969781 -0.2400008 0.3661139 -0.0388549 0.9796911 1.4552985 0.4864688 -0.2596191 0.8315842 0.4166377 0.2726834 -0.3572982 -0.0037498 1.0462517 -0.5894349 -0.0540747 0.4479567 -0.0531977 -0.0969063 0.2515756 0.6701438 0.310679 -0.1894616 0.0129475 0.0380699 -0.0461327 0.0480329 0.0175937 0.0430252 0.0044439 0.0428435 0.0477963 0.2452493 0.1650118 -0.0276838 0.056785 -0.0650651 -0.0401947 -0.3500261 -0.1686505 -0.0527248 -0.3553145 -0.1164045 -0.0985712 -0.1868009 -0.236609 -0.0352816 -0.2051781 -0.0564598 -0.0034886 -0.146877 0.0726907 -0.097335 0.1313626 -0.1606963 0.1036605 0.1787339 0.2284146 0.2368168 0.0453551 -0.0638609 0.0613734 -0.0508056 0.0582543 0.0255956 0.0773976 0.0577545 0.0255927 0.031255 0.084913 0.0518648 0.0526951 0.0326948 -0.020797 0.046956 -0.0779323 0.0354743 0.0639222 -0.0143962 -0.0948813 0.0300657 0.0659366 -0.0448005 -0.0886121 -0.0194321 -0.0061016 0.0322788 -0.0391397 0.0406872 -0.0401571 -0.0808145 0.0733641 -0.0071742 0.0651578 0.0907789 -0.1096467 0.09218 0.0738136 0.104371 0.058078 -0.0174997 0.1115592 -0.0411282 0.0292699 0.0888282 -0.0165661 -0.0413833 -0.0452455 0.0348103 -0.0931394 -0.1078413 -0.0569953 -0.0592703 0.0191389 -0.121374 0.0305736 -0.0742207 -0.0573202 0.0466623 -0.000939 0.060307 0.0682586 0.153037 -0.0553564 -0.0404772 -0.0585021 0.1268475 -0.022712 -0.0518005 -0.0496859 0.0912071 0.0970671 -0.0359863 0.0528931 -0.0281694 0.1672227 -0.0335724 0.093372 -0.0172191 -0.0313861 0.0523834 -0.0870698 0.0172593 -0.0808351 0.1532616 -0.0179344 0.0365697 -0.0123729 0.1007704 unknown
polarizability: 150.8328817|23.5846657|82.1768862|-9.8631309|5.5843499|123.3988177 unknown
InChI: InChI=1S/C9H10O2S/c1-2-7(10)6-8(11)9-4-3-5-12-9/h3-5H,2,6H2,1H3
charge 0 multiplicity 1
22 atoms
S  2.444258 0.510944 1.450465
O  -1.686438 -0.984937 -1.488452
O  -0.201436 -0.596145 2.555073
C  -0.947944 -1.920956 0.641097
C  -3.126681 -0.514765 0.440901
C  -1.917428 -1.122801 -0.258601
C  0.032704 -0.971621 1.36537
C  1.206176 -0.519744 0.613325
C  -3.929741 0.464352 -0.431346
C  1.548301 -0.726469 -0.728039
C  2.774756 -0.090556 -1.111319
C  3.378024 0.602625 -0.065876
H  -1.510776 -2.446179 1.430564
H  -0.403781 -2.646436 0.015898
H  -2.77236 -0.039611 1.378831
H  -3.767582 -1.358274 0.776827
H  -4.811113 0.83901 0.118019
H  -4.273176 -0.024582 -1.358748
H  -3.3104 1.328846 -0.727094
H  0.911319 -1.285841 -1.418007
H  3.194779 -0.139396 -2.118277
H  4.312042 1.162937 -0.078308
