program: Gaussian 09
title: 000255132
version: EM64L-G09RevD.01
frameworkgroup: C1[X(C10H12O2S)]
method: RPBEPBE
basis: SDD
operation: Freq
keyword: #p
keyword: freq=noraman
keyword: PBEPBE/SDD
title: #p freq=noraman PBEPBE/SDD
converged: YES YES NO NO
title: Mulliken charges:
elementType: S O O C C C C C C C C C C H H H H H H H H H H H H
charge: 0.336074 -0.205964 -0.214154 -0.476898 -0.351131 0.226762 -0.616683 -0.688036 0.271820 -0.275204 -0.250028 -0.147358 -0.512577 0.261002 0.232837 0.213893 0.220687 0.260480 0.249528 0.212760 0.223466 0.206443 0.296682 0.253900 0.271698
chargesum: 0.00000
title: Mulliken charges with hydrogens summed into heavy atoms:
elementType: S O O C C C C C C C C C C
charge: 0.336074 -0.205964 -0.214154 0.016941 0.083449 0.226762 -0.106675 -0.045366 0.271820 -0.275204 0.046654 0.106543 -0.240879
polarizability: 1.64553390e+02 1.02314247e+01 1.33821915e+02 -2.17878489e+01 -4.00775315e-01 9.14829714e+01
1716.lowfreq: -16.5939 -7.6831 -1.5252 -0.0020 -0.0014 -0.0009 21.9757 36.6850 48.8256
frequency: 21.3103 36.5654 48.7489 65.8091 88.3425 127.7578 144.8038 175.5698 185.4834 227.1015 297.9442 340.8298 400.1906 422.7588 448.5748 496.6198 538.8036 569.1697 602.1780 642.4419 695.2838 707.0760 727.6719 748.2300 822.0227 827.1668 853.5553 868.4369 903.8751 916.2161 930.6803 959.3191 1048.1321 1061.1479 1072.5375 1081.6579 1094.6961 1122.9307 1172.3995 1209.1129 1229.4400 1243.7383 1275.9905 1281.7395 1300.5957 1345.1929 1358.2285 1394.6674 1428.0682 1451.4705 1457.6073 1471.0571 1478.6257 1484.5726 1519.8343 1571.7612 1626.2889 2953.1243 2974.4754 2998.9458 3001.6950 3035.5821 3047.2910 3075.2568 3077.8503 3111.8239 3172.9339 3190.3714 3233.0602
redmass: 5.1165 4.8533 1.7491 6.0824 3.5594 4.4602 5.1799 4.7434 5.0261 1.0943 7.4675 3.4330 2.5961 5.5032 5.5834 4.0091 3.7195 3.1605 3.3282 7.3855 5.9392 2.2859 1.1787 1.6963 3.2424 3.2340 1.3091 1.7373 2.4500 2.7814 1.5201 1.9164 1.9802 2.0368 1.8941 1.5229 1.2163 2.0922 1.8495 1.3691 1.4979 1.3879 1.6745 1.3828 1.5484 2.4164 1.7573 1.2152 1.0962 5.1933 1.1379 1.0576 1.0424 1.0724 5.5613 9.1332 8.1547 1.0626 1.0361 1.0927 1.0632 1.0574 1.1001 1.1008 1.0998 1.1060 1.0915 1.0969 1.1002
irintensity: 1.9800 3.3634 1.3130 1.6636 5.1954 0.4335 1.3986 2.2410 9.8686 0.0935 1.6173 1.0386 2.4525 2.4346 2.2161 0.6279 7.3287 7.7545 27.2836 2.7856 8.2192 3.1772 98.6497 1.9103 21.2653 3.6540 12.8216 5.2087 26.5951 50.0257 12.4352 5.8851 15.0297 12.4367 62.8019 7.3318 36.2789 23.6380 148.2019 14.8557 5.5672 75.7311 72.2162 22.2005 22.1470 10.7551 33.9674 6.4126 32.1282 84.1703 26.1164 4.5170 12.6639 13.8033 32.2203 239.0502 66.4819 12.0288 36.2156 2.4745 16.8175 5.0675 0.1133 60.4773 55.5385 6.2522 2.4407 4.6078 0.4870
temp: 298.150 k
press: 1.00000 atm
elementType: 16 8 8 6 6 6 6 6 6 6 6 6 6 1 1 1 1 1 1 1 1 1 1 1 1
symmnumber: 1
zpe: 511370.3 jmol-1
zpe.correction: 0.194771 hartree
zpe.thermalcorrener: 0.208571 hartree
zpe.thermalcorrenthalpy: 0.209515 hartree
zpe.thermalcorrgfe: 0.151586 hartree
zpe.sumelectzpe: -935.782531 hartree
zpe.sumelectthermal: -935.768731 hartree
zpe.sumelectthermalent: -935.767787 hartree
zpe.sumelectthermalfe: -935.825716 hartree
dipole: 0.4861 1.4803 0.3491
dipole: 1.5967
quadrupole: -70.4410 -94.5775 -80.8687
quadrupole: 8.5641 -5.0414 0.1898
quadrupole: 11.5214 -12.6151 1.0937 8.5641 -5.0414 0.1898
hfenergy: -935.977302 hartree
pointgroup: C01 [X(C10H12O2S1)]
dipole: 0.2497159 -0.0209651 -0.5760372 debye
dipolederiv: 0.1177807 0.0488897 0.0066609 0.0321851 0.1362897 -0.0095701 -0.0621911 0.0297301 -0.2260445 -0.5994066 -0.0543967 0.0773234 -0.2766614 -0.3931915 -0.248811 -0.130823 -0.1420948 -0.7904714 -0.622832 0.1835464 0.100754 0.2389492 -0.4129366 -0.0361211 0.1474697 -0.260359 -0.9173864 -0.3463878 -0.1132196 0.1839426 -0.1030629 0.0751999 -0.0889534 0.2650778 -0.025144 -0.1033532 0.0909062 -0.0191983 0.0157215 0.0243484 0.0992445 -0.021577 0.099139 -0.0256589 0.1049537 1.2346406 0.2765201 -0.0462819 0.8018574 0.3266758 0.4912097 0.0985918 0.2575565 0.8000857 -0.8816792 -0.0499141 -0.4579745 -0.1068076 -0.1115668 -0.0142959 -0.59037 0.005052 -0.3177475 -0.021768 -0.0433871 0.0509175 -0.0891954 0.0658214 0.0008686 0.0173046 -0.0016277 0.0566578 1.3663593 -0.6080677 -0.062248 -0.9844965 0.4987882 -0.0539165 0.0018238 0.2325569 1.0438367 -0.5886184 0.2354373 0.3649439 0.3182021 -0.3300421 -0.223441 0.5763492 -0.2961057 0.0430611 0.2286754 -0.1802034 0.0439654 -0.1954532 0.0284924 0.0089493 -0.291152 0.1579604 -0.1348914 -0.3327916 0.0771942 -0.1351302 0.1086554 -0.1862715 0.1133197 -0.2624864 0.139882 -0.0756584 -0.1656806 -0.1060465 -0.0737826 -0.0628112 -0.2086769 0.0747457 0.1982912 -0.0665496 0.3006201 0.0761368 -0.0123186 -0.0691274 -0.0540505 0.074926 0.0253888 -0.0723373 -0.0121601 -0.0312543 0.0341405 0.0723944 0.0156952 0.0273996 -0.0864096 0.0069202 -0.0245951 0.0102605 0.1058062 -0.0389817 0.1067629 0.0121614 0.0778651 -0.0870422 0.0031066 -0.0083421 0.0033264 0.070152 0.0535092 -0.0092668 -0.0205905 -0.0159959 0.0636755 0.0474766 -0.0570374 0.0175696 -0.1310969 0.0158621 -0.0617441 0.0796734 -0.0311674 0.0691988 0.0052867 0.0679457 0.0611551 0.009025 0.0511569 0.0816898 0.031903 0.0757016 0.0203473 -0.0254198 0.0517352 -0.0574048 0.0591633 0.0588482 0.0127329 -0.0801731 0.017917 0.0894164 0.0243414 -0.0139243 0.047833 -0.1587475 -0.0514903 -0.1205443 -0.0181296 -0.165057 -0.0752181 -0.0522306 -0.0372702 -0.0703877 0.0681776 -0.0136406 0.0972585 0.0118403 0.168308 -0.0944744 0.0075326 0.0087526 0.0282717 0.0775559 0.1702361 0.0345287 -0.0530778 0.0333166 0.1423488 0.005053 -0.0628075 0.031824 0.0699469 0.100817 0.0578394 0.0374719 0.0649746 0.150898 -0.0401524 0.0777854 -0.0590802 -0.0193218 0.0642078 0.0935129 -0.0164587 0.0950789 0.144507 0.0002897 0.0030706 -0.0064058 0.0969313 unknown
polarizability: 162.8075562|-27.6128724|96.5473114|-0.772934|8.0437395|130.5034087 unknown
InChI: InChI=1S/C10H12O2S/c1-2-4-8(11)7-9(12)10-5-3-6-13-10/h3,5-6H,2,4,7H2,1H3
charge 0 multiplicity 1
25 atoms
S  2.696855 0.005316 1.701823
O  -1.263526 0.637047 -1.743289
O  0.128257 1.599339 2.25114
C  -2.76562 0.933392 0.172649
C  -3.598399 -0.268368 -0.312904
C  -1.507372 1.198669 -0.642748
C  -0.504027 2.201094 -0.032245
C  -4.8758 -0.466292 0.529483
C  0.397581 1.50832 1.014152
C  1.539408 0.740531 0.511478
C  1.904378 0.428577 -0.802997
C  3.085456 -0.379139 -0.893406
C  3.630708 -0.686818 0.349721
H  -2.469838 0.820791 1.236842
H  -3.378919 1.861103 0.147056
H  -2.973257 -1.180643 -0.274295
H  -3.85811 -0.1240 -1.377899
H  0.099608 2.634516 -0.845903
H  -1.044835 2.998129 0.504694
H  -4.631896 -0.636815 1.594999
H  -5.454913 -1.337475 0.173696
H  -5.535389 0.420607 0.474064
H  1.312046 0.74086 -1.667074
H  3.514519 -0.722936 -1.837041
H  4.521986 -1.273104 0.569403
