program: Gaussian 09
title: 000255128
version: EM64L-G09RevD.01
frameworkgroup: C1[X(C7H7ClOS)]
method: RPBEPBE
basis: SDD
operation: Freq
keyword: #p
keyword: freq=noraman
keyword: PBEPBE/SDD
title: #p freq=noraman PBEPBE/SDD
converged: NO NO NO NO
title: Mulliken charges:
elementType: Cl S O C C C C C C C H H H H H H H
charge: 0.026864 0.382872 -0.219301 -0.466301 0.281189 -0.248528 -0.676674 -0.246472 -0.066148 -0.448194 0.233550 0.233388 0.233438 0.211192 0.233242 0.265623 0.270259
chargesum: 0.00000
title: Mulliken charges with hydrogens summed into heavy atoms:
elementType: Cl S O C C C C C C C
charge: 0.026864 0.382872 -0.219301 0.000637 0.281189 -0.248528 0.001198 0.019151 0.204111 -0.448194
polarizability: 1.67427137e+02 -3.46885002e+00 1.01372118e+02 -1.05110464e-02 -2.14262394e-03 4.84946923e+01
1716.lowfreq: -0.0012 -0.0011 0.0005 2.9809 8.6067 16.9124 32.0127 69.9550 101.0608
frequency: 31.8750 69.9520 101.0497 108.0428 193.9979 228.8531 248.1354 277.4046 287.0162 408.6989 438.0591 491.1282 540.0894 587.0728 624.9527 670.6396 698.6115 792.1240 812.9431 870.4310 903.3878 955.8577 1009.1890 1067.1822 1070.2795 1095.5372 1198.8698 1228.3915 1243.7114 1310.6440 1328.1293 1397.1947 1438.3655 1457.4599 1469.9266 1479.0175 1534.3814 1573.8673 2973.5727 2999.2730 3021.5890 3095.6950 3105.1526 3178.1660 3200.2378
redmass: 2.2939 3.0015 19.4494 5.7809 1.2237 6.4206 4.6170 10.7648 4.2384 11.3674 5.6433 6.6223 2.9726 2.6657 8.0658 6.1148 4.9238 1.2926 1.3504 5.0194 1.4119 5.0799 1.6068 1.8231 1.6105 2.1821 1.8671 2.0088 1.1842 2.9682 2.2247 1.2076 1.1110 7.5270 1.0389 1.0565 5.6232 8.1731 1.0596 1.0365 1.0989 1.1002 1.1002 1.0915 1.1001
irintensity: 0.0287 1.2326 0.7133 1.3321 0.5094 0.6431 0.0000 0.0755 14.3448 0.1876 11.1867 17.8433 2.1154 3.1488 1.0652 3.7342 1.0350 70.4437 7.4665 33.9936 0.0782 90.0498 7.7996 14.4148 0.5028 4.5397 11.5484 116.8730 0.1413 3.8032 37.7367 26.9130 18.0771 250.4223 12.1074 9.8364 5.9224 155.0683 26.7217 29.0680 10.0121 25.9079 29.7116 3.0576 0.3100
temp: 298.150 k
press: 1.00000 atm
elementType: 17 16 8 6 6 6 6 6 6 6 1 1 1 1 1 1 1
symmnumber: 1
zpe: 315910.8 jmol-1
zpe.correction: 0.120324 hartree
zpe.thermalcorrener: 0.130827 hartree
zpe.thermalcorrenthalpy: 0.131771 hartree
zpe.thermalcorrgfe: 0.082597 hartree
zpe.sumelectzpe: -1203.528310 hartree
zpe.sumelectthermal: -1203.517807 hartree
zpe.sumelectthermalent: -1203.516863 hartree
zpe.sumelectthermalfe: -1203.566037 hartree
dipole: 0.1064 4.1464 -0.0011
dipole: 4.1478
quadrupole: -71.7310 -72.1988 -74.1437
quadrupole: 5.9417 -0.0042 -0.0009
quadrupole: 0.9601 0.4924 -1.4525 5.9417 -0.0042 -0.0009
hfenergy: -1203.6486342 hartree
pointgroup: C01 [X(C7H7Cl1O1S1)]
dipole: 0.0377145 -1.6314164 -0.0034483 debye
dipolederiv: -0.8663731 -0.1007338 0.0002967 -0.1832646 -0.0903923 -0.0001044 0.000112 -0.0001486 0.0219058 -0.0705619 -0.0229997 0.0001223 -0.1084816 -0.184133 -0.0006595 -0.0000623 -0.00072 0.2109271 -0.8421122 0.0725218 0.0004597 0.4419989 -0.7666948 -0.0012108 0.0009869 -0.0010382 -0.2963802 -0.1849243 -0.128985 -0.0001053 -0.2608045 -0.1701158 -0.0009302 -0.0011794 -0.0011774 0.150786 1.7433716 -0.1126345 -0.0008038 -0.3526835 0.7937226 0.0016883 -0.0008638 0.001619 0.1447249 -0.9047217 0.3624321 0.0010082 0.595074 0.1318174 0.0002587 0.0013988 0.0003839 -0.179713 -0.0309182 0.0364837 0.0002907 -0.0199801 0.0658606 0.0000989 0.0002175 0.0001608 0.0627328 0.4084233 0.0468645 -0.0001493 -0.2560197 -0.1166068 0.0001524 -0.0007259 -0.0000438 -0.1046633 -0.5887476 -0.1794189 -0.0000792 -0.3616749 -0.1865106 0.0000307 -0.0004158 -0.0000449 -0.1143829 1.1613456 0.0498069 -0.0006359 0.4613729 0.421639 0.000891 0.000132 0.0011036 -0.2072156 -0.0097813 0.0413311 0.0696901 0.0441226 0.0244819 -0.0859346 0.061894 -0.100279 -0.0283383 -0.0100739 0.0424576 -0.0696914 0.0451172 0.0229905 0.086293 -0.0615506 0.1006877 -0.0264493 0.0810419 0.0082802 -0.0086733 0.0724693 0.0343341 0.1072878 -0.0410249 0.0936509 -0.058272 -0.093093 -0.1052182 -0.0001765 -0.1652693 -0.0563131 -0.0005106 -0.0003621 -0.0005841 0.1035863 0.0807384 0.0079409 0.0083347 0.07161 0.0359775 -0.106766 0.0413095 -0.0930065 -0.0605359 0.0702554 -0.0741526 -0.0000665 -0.1026835 0.0147056 -0.000235 -0.0000913 -0.000227 0.1782277 0.056131 0.0560237 0.0001787 0.0790969 0.025237 -0.0003497 0.0002253 -0.0003364 0.20306 unknown
polarizability: 167.607921|-0.2365077|101.1911074|-0.0691963|0.0996612|48.4949194 unknown
InChI: InChI=1S/C7H7ClOS/c1-2-5(9)6-3-4-7(8)10-6/h3-4H,2H2,1H3
charge 0 multiplicity 1
17 atoms
Cl 4.154979 0.464219 -0.000707
S  1.161468 1.280678 0.002321
O  -1.848987 1.590802 0.004726
C  -2.561091 -0.761091 -0.000063
C  -1.518081 0.366125 0.001979
C  -0.097865 -0.030472 0.000605
C  -4.006851 -0.234876 0.004742
C  0.491227 -1.29768 -0.001904
C  1.925188 -1.28355 -0.00263
C  2.430251 0.009899 -0.000633
H  -2.38141 -1.399932 -0.888437
H  -2.377934 -1.406833 0.882558
H  -4.19933 0.395777 -0.879502
H  -4.723161 -1.075823 0.002076
H  -4.196476 0.387596 0.895396
H  -0.092604 -2.221388 -0.003213
H  2.553578 -2.176052 -0.004515
