program: Gaussian 09
title: 000255127
version: EM64L-G09RevD.01
frameworkgroup: C1[X(C9H12OS)]
method: RPBEPBE
basis: SDD
operation: Freq
keyword: #p
keyword: freq=noraman
keyword: PBEPBE/SDD
title: #p freq=noraman PBEPBE/SDD
converged: NO NO NO NO
title: Mulliken charges:
elementType: S O C C C C C C C C C H H H H H H H H H H H H
charge: 0.242291 -0.225755 -0.492896 -0.356139 0.203221 -0.422237 0.487147 -0.690205 -0.268023 -0.766332 -0.500810 0.237332 0.237346 0.219060 0.219029 0.206399 0.222397 0.206404 0.254591 0.210196 0.254193 0.254198 0.268594
chargesum: 0.00000
title: Mulliken charges with hydrogens summed into heavy atoms:
elementType: S O C C C C C C C C C
charge: 0.242291 -0.225755 -0.018218 0.081951 0.203221 -0.422237 0.487147 -0.055005 -0.013433 -0.047745 -0.232217
polarizability: 1.55419697e+02 4.83143662e+00 1.27689570e+02 -5.45757052e-03 7.54299716e-04 6.41101033e+01
1716.lowfreq: 0.0003 0.0019 0.0020 2.0864 9.0860 11.1807 36.4901 45.3645 91.1791
frequency: 36.4467 45.3388 91.1533 98.5191 121.7626 142.8706 224.1228 237.6932 242.0126 258.3643 349.1445 388.5078 424.7244 439.6757 526.1811 546.4691 637.1504 654.0818 732.7437 736.5627 745.3414 774.2538 872.4742 885.9556 894.4528 927.2196 977.6433 1021.5838 1035.9563 1053.4841 1085.2343 1089.3626 1122.3522 1216.8546 1218.1600 1229.5306 1285.3472 1295.1279 1352.0188 1366.2679 1395.2320 1402.8765 1430.2363 1444.8116 1451.0758 1468.8006 1470.4812 1480.7687 1483.6911 1526.5118 1561.8915 2956.7583 2970.4553 2992.0893 3002.3540 3005.3575 3046.0292 3072.5221 3075.6084 3078.9481 3093.6234 3171.3701 3233.2852
redmass: 1.5596 4.1503 2.1875 4.1701 1.3518 3.4066 4.0362 1.1644 3.0854 3.9706 3.9454 5.0065 5.2645 4.3627 5.9848 2.5392 2.7559 7.3892 1.2069 5.6898 1.2709 5.3300 1.4076 2.3151 1.2955 2.7454 3.2461 1.7332 1.5214 2.4851 1.5384 1.2418 2.1152 2.2548 1.3501 1.6332 1.0876 1.9848 1.7900 3.1076 1.2177 1.2074 1.1987 2.6501 1.0453 1.0644 1.4047 1.0419 1.0703 6.6254 7.1341 1.0596 1.0361 1.0361 1.0976 1.0612 1.1001 1.0987 1.1023 1.0961 1.1015 1.0924 1.0994
irintensity: 0.3492 2.2176 1.4273 0.6040 2.3605 0.8496 4.5369 0.6496 3.5103 2.2029 4.8571 1.2439 5.3372 0.2461 2.1262 2.8619 7.4113 6.4619 18.5049 5.8886 59.1261 9.2026 1.1826 34.1892 2.0982 15.0830 20.8536 4.6182 9.6147 1.8393 1.8847 0.0455 1.8469 90.1533 0.3963 1.3416 0.3460 71.2327 22.6907 4.0288 7.5334 31.3219 13.3963 111.4105 13.6703 4.5076 27.6521 12.6068 13.8538 97.3062 76.0555 21.9944 38.6683 17.8075 7.4692 15.8216 1.1225 50.8563 74.6616 10.3894 26.4145 6.3409 0.3611
temp: 298.150 k
press: 1.00000 atm
elementType: 16 8 6 6 6 6 6 6 6 6 6 1 1 1 1 1 1 1 1 1 1 1 1
symmnumber: 1
zpe: 485665.5 jmol-1
zpe.correction: 0.184980 hartree
zpe.thermalcorrener: 0.197236 hartree
zpe.thermalcorrenthalpy: 0.198180 hartree
zpe.thermalcorrgfe: 0.145343 hartree
zpe.sumelectzpe: -822.599512 hartree
zpe.sumelectthermal: -822.587256 hartree
zpe.sumelectthermalent: -822.586312 hartree
zpe.sumelectthermalfe: -822.639149 hartree
dipole: -1.7674 -1.9095 0.0006
dipole: 2.6019
quadrupole: -63.2571 -75.7111 -75.2026
quadrupole: -2.3226 -0.0003 0.0018
quadrupole: 8.1332 -4.3209 -3.8123 -2.3226 -0.0003 0.0018
hfenergy: -822.784492 hartree
pointgroup: C01 [X(C9H12O1S1)]
dipole: 0.6805473 -0.7646895 0.0037067 debye
dipolederiv: -0.1193465 -0.2197016 0.0011522 -0.1924581 -0.255276 0.0019074 0.0009828 0.0019112 0.1132447 -0.7856936 0.1154009 -0.0006082 0.3987637 -0.8850428 0.0029342 -0.0020844 0.0029825 -0.2853892 -0.3318588 -0.1237669 0.0005391 -0.3454658 -0.1507623 0.0013707 0.001547 0.0014044 0.1516764 0.112147 0.0044817 -0.0000223 -0.0354015 0.0778874 0.0003173 0.0001334 0.0003235 0.1423579 1.7366157 -0.2369924 0.0013194 -0.2378641 0.8491162 -0.0033389 0.0013994 -0.0034046 0.1525576 -1.0948507 0.2409337 -0.0012631 0.0299015 0.2689807 -0.0026266 -0.0001755 -0.0025863 -0.233844 0.2217982 -0.276688 0.0014313 0.2038566 0.2922216 -0.001244 -0.0009805 -0.0012416 0.0466968 -0.0511563 -0.0546841 0.000218 -0.011708 0.0487438 0.0002236 0.0000055 0.0002169 0.1052152 -0.0094335 0.1075115 -0.0005585 0.0310841 -0.4506587 0.0015365 -0.0001706 0.0015244 -0.1532747 0.1997662 0.069666 -0.0003813 -0.0767225 -0.1743737 0.0010132 0.0003333 0.0009799 0.0251561 0.1305845 0.3172989 -0.0016577 0.1650377 0.1242495 -0.0020501 -0.0008532 -0.0020673 -0.2726351 0.0240193 0.0244008 -0.0349507 0.0453023 0.0116409 0.089306 -0.0557288 0.0984046 -0.0315173 0.0239789 0.0247037 0.034686 0.0457988 0.0098831 -0.0896597 0.0553041 -0.0987734 -0.0297521 0.0387793 -0.0194113 0.0065516 0.0221545 -0.0087867 0.1074033 -0.0032123 0.1114676 -0.0655062 0.0387022 -0.0194085 -0.0063428 0.0221995 -0.0107782 -0.107918 0.003073 -0.1120138 -0.0636122 0.0843844 0.0139178 0.0350211 -0.0442967 -0.020273 -0.1222878 -0.0125508 -0.1351365 -0.0909103 -0.2017099 0.0767008 -0.0004258 0.1204281 0.0289875 0.000372 -0.0006441 0.0003588 0.1013623 0.0843773 0.0134952 -0.0350234 -0.0442933 -0.0179494 0.1216074 0.0130932 0.1344886 -0.0932353 -0.056925 -0.0364797 0.0001901 -0.095232 0.0813782 0.0005264 0.0004925 0.0005319 0.1833968 -0.1700543 -0.1229743 0.0006767 -0.0117005 0.0504684 0.0003086 0.0001058 0.000325 0.1099037 0.0472502 0.0214785 -0.0826584 -0.0109889 0.0454472 0.0398285 -0.0499253 0.0661434 -0.0117022 0.0473 0.0222875 0.0824024 -0.0105058 0.0443377 -0.0404052 0.0500193 -0.0667205 -0.0106662 0.0313255 0.05783 -0.0002956 0.0321103 0.0405584 0.0008753 -0.0001637 0.0008813 0.2104776 unknown
polarizability: 155.2203686|-5.3693137|127.8872483|0.0304034|-0.3243872|64.111753 unknown
InChI: InChI=1S/C9H12OS/c1-3-4-8(10)9-7(2)5-6-11-9/h5-6H,3-4H2,1-2H3
charge 0 multiplicity 1
23 atoms
S  0.903847 -1.920755 0.010863
O  -0.832642 1.741917 -0.007735
C  -1.894772 -0.468182 0.003021
C  -3.248483 0.266731 -0.000484
C  -0.685541 0.477004 -0.001421
C  0.66598 -0.112828 0.001544
C  1.902753 0.561304 -0.001947
C  -4.440954 -0.712706 0.003566
C  3.021773 -0.347532 0.002716
C  2.07064 2.062179 -0.00963
C  2.6728 -1.690369 0.009605
H  -1.820104 -1.131591 0.890575
H  -1.820062 -1.139904 -0.878248
H  -3.298713 0.928268 -0.88507
H  -3.299059 0.936051 0.878206
H  -4.424151 -1.37044 -0.886681
H  -5.402604 -0.16793 0.000758
H  -4.424784 -1.362367 0.899733
H  4.059985 -0.00479 0.000943
H  3.141092 2.332694 -0.011209
H  1.580252 2.513025 -0.889822
H  1.580603 2.521967 0.866119
H  3.32314 -2.563744 0.014099
