program: Gaussian 09
title: 000255125
version: EM64L-G09RevD.01
frameworkgroup: C1[X(C8H4BrF3O2S)]
method: RPBEPBE
basis: SDD
operation: Freq
keyword: #p
keyword: freq=noraman
keyword: PBEPBE/SDD
title: #p freq=noraman PBEPBE/SDD
converged: YES YES NO NO
title: Mulliken charges:
elementType: Br S F F F O O C C C C C C C C H H H H
charge: 0.114119 0.409686 -0.157112 -0.126731 -0.145219 -0.185326 -0.146338 -0.619699 0.316403 -0.291587 0.160810 -0.242009 0.333503 -0.049089 -0.516786 0.279404 0.294122 0.299067 0.272783
chargesum: 0.00000
title: Mulliken charges with hydrogens summed into heavy atoms:
elementType: Br S F F F O O C C C C C C C C
charge: 0.114119 0.409686 -0.157112 -0.126731 -0.145219 -0.185326 -0.146338 -0.046174 0.316403 -0.291587 0.160810 0.057058 0.333503 0.223693 -0.516786
polarizability: 2.06038164e+02 1.14105552e+01 1.21741438e+02 -2.01809459e+01 1.08666525e+01 7.10366790e+01
1716.lowfreq: -6.5076 -1.7455 -0.0007 -0.0006 0.0010 4.8100 12.7761 24.6127 50.8451
frequency: 12.6586 24.5543 50.8241 55.9117 92.1383 101.2786 130.7531 181.8983 203.4365 236.4656 245.0747 264.6713 328.4977 366.2935 382.7094 435.9170 447.0498 478.4055 500.3571 523.0293 555.6566 585.3398 636.0987 644.2184 667.6908 690.7772 777.2942 817.0758 887.3068 921.5315 930.4621 954.2115 1003.1952 1010.9880 1066.6553 1082.9201 1135.6966 1207.0655 1227.2646 1241.6552 1285.1836 1322.7168 1443.5902 1447.5406 1522.6225 1586.2874 1643.8316 3035.8485 3117.5058 3179.5229 3204.2219
redmass: 17.7922 15.7071 7.7720 12.0584 18.2838 11.1096 12.6679 12.3465 10.2759 7.2442 8.4707 10.8516 11.3987 5.0866 7.6983 14.9216 7.2505 8.1485 6.6881 7.3152 3.4485 4.6989 6.9976 8.6177 9.7483 6.5055 6.6770 1.2923 4.6650 1.4918 5.3014 2.8848 11.1008 4.9348 5.0145 1.7852 1.8691 2.1971 1.6921 2.0604 2.1216 2.9118 5.8409 1.1292 5.8643 9.9158 10.7737 1.0583 1.1045 1.0932 1.0995
irintensity: 0.0994 0.2032 1.3794 1.5458 0.2094 1.0079 3.6462 4.7325 7.1963 5.0860 0.1822 1.4210 3.7610 3.4666 2.2136 7.5067 9.2402 12.1290 15.5688 23.1049 0.4252 32.7228 2.4108 8.1203 0.2858 5.3226 1.7717 54.8735 65.0925 0.9586 120.2396 25.1663 197.1913 253.7275 179.3452 85.0540 85.8978 61.7173 125.6422 4.5858 10.1373 28.0691 313.3270 43.9027 32.7358 317.7977 86.5092 1.6106 0.1460 3.0703 1.7531
temp: 298.150 k
press: 1.00000 atm
elementType: 35 16 9 9 9 8 8 6 6 6 6 6 6 6 6 1 1 1 1
symmnumber: 1
zpe: 274506.5 jmol-1
zpe.correction: 0.104554 hartree
zpe.thermalcorrener: 0.119359 hartree
zpe.thermalcorrenthalpy: 0.120303 hartree
zpe.thermalcorrgfe: 0.058200 hartree
zpe.sumelectzpe: -1167.613221 hartree
zpe.sumelectthermal: -1167.598416 hartree
zpe.sumelectthermalent: -1167.597472 hartree
zpe.sumelectthermalfe: -1167.659575 hartree
dipole: -2.4864 -1.7525 -2.7936
dipole: 4.1301
quadrupole: -103.6513 -109.9187 -98.1056
quadrupole: 3.5963 -7.0456 0.9160
quadrupole: 0.2406 -6.0268 5.7863 3.5963 -7.0456 0.9160
hfenergy: -1167.717775 hartree
pointgroup: C01 [X(C8H4Br1F3O2S1)]
dipole: -1.1103653 1.1849859 -0.0569241 debye
dipolederiv: -0.6649533 -0.1624708 -0.1970701 -0.223814 -0.0080585 -0.0258603 -0.1788585 -0.0047719 0.0107966 -0.0020192 -0.0509049 -0.0749715 -0.1257985 -0.0395203 0.1308032 -0.0180039 0.174874 0.0807148 -0.7373762 -0.0939233 -0.238194 0.0393944 -0.3171951 -0.0850937 -0.2113097 -0.1279365 -0.496613 -0.5358685 -0.0054216 0.2663674 0.080515 -0.2614975 -0.0462756 0.3235199 0.0192791 -0.6916562 -0.5046104 -0.0645924 0.0354957 -0.0489536 -0.6696279 0.0167702 0.0803425 0.0387041 -0.2636501 -0.7150015 -0.0270452 -0.1425783 0.1515383 -0.5636515 0.4628592 -0.3437995 0.2268541 -0.7089319 -0.3373077 0.1320592 -0.0621662 -0.0492384 -0.4658585 0.2290999 0.4316127 0.2685801 -0.7037508 -0.8089237 -0.3143691 0.3907065 -0.3651684 -0.1903056 0.1241866 0.4635622 0.1723472 -0.3593753 1.9322698 0.2699292 0.2909101 0.231372 0.6992775 -0.6292666 0.6951504 -0.2981356 0.7356075 -0.9412684 0.1895746 -0.420592 0.4505836 0.0775863 0.0035762 -0.6803119 -0.099777 -0.3611051 0.5067268 -0.3018835 -0.1680369 -0.2734621 0.3436792 -0.1890306 -0.8711772 -0.4034775 0.9627745 0.429666 0.0977767 0.1355375 -0.2902178 -0.1616628 -0.0301128 0.4362426 0.0840627 0.04484 1.6865448 0.3037909 -0.0493699 0.1181574 1.1998214 0.1143325 -0.1657556 0.0773014 1.3950009 -0.7800223 -0.2746826 -0.0619514 -0.4386039 -0.2101135 -0.0879916 0.0087854 -0.0551588 -0.0480005 1.1129333 0.2767852 0.4035525 0.6831874 0.2399315 -0.0886182 0.1225642 -0.2449527 0.0031508 0.0771975 0.086729 -0.0020447 0.0771723 0.0215987 -0.0249405 0.0248837 0.0281184 0.0889724 0.0554686 -0.0058492 -0.0536498 0.0215624 0.1036793 0.019685 -0.0394784 0.0216886 0.0701166 0.141743 -0.0614234 -0.0010009 -0.0642472 0.1034785 0.0210208 -0.0093726 0.0415675 0.137669 0.0848015 0.005921 -0.0509442 0.026021 0.0984389 0.0848562 -0.0685962 0.0808327 0.1034398 unknown
polarizability: 200.4150348|23.8360971|98.2290978|27.0606962|-24.2851879|100.1721484 unknown
InChI: InChI=1S/C8H4BrF3O2S/c9-7-2-1-5(15-7)4(13)3-6(14)8(10,11)12/h1-2H,3H2
charge 0 multiplicity 1
19 atoms
Br -5.46172 -0.875009 -0.764799
S  -2.66433 -1.182131 0.793612
F  3.881344 0.174734 0.418331
F  3.436756 -0.062289 -1.795425
F  2.442137 -1.4424 -0.290827
O  0.100942 -1.091866 2.070057
O  1.289963 1.555699 -1.335536
C  1.047743 0.912141 1.025408
C  -0.082664 -0.152573 1.246909
C  -1.330987 0.024333 0.510094
C  1.667817 0.876161 -0.35766
C  -1.719261 1.001682 -0.414604
C  2.864792 -0.113639 -0.525572
C  -3.047743 0.833772 -0.918098
C  -3.683509 -0.279478 -0.37467
H  0.618732 1.917635 1.175921
H  1.803955 0.709326 1.799944
H  -1.05677 1.807187 -0.740642
H  -3.514997 1.496216 -1.648242
