program: Gaussian 09
title: 000255121
version: EM64L-G09RevD.01
frameworkgroup: C1[X(C7H7BrOS)]
method: RPBEPBE
basis: SDD
operation: Freq
keyword: #p
keyword: freq=noraman
keyword: PBEPBE/SDD
title: #p freq=noraman PBEPBE/SDD
converged: NO YES NO NO
title: Mulliken charges:
elementType: Br S O C C C C C C C H H H H H H H
charge: 0.091417 0.384345 -0.218517 -0.467108 0.280516 -0.259644 -0.677330 -0.250238 -0.046634 -0.515966 0.233570 0.233452 0.233412 0.211187 0.233252 0.267954 0.266331
chargesum: 0.00000
title: Mulliken charges with hydrogens summed into heavy atoms:
elementType: Br S O C C C C C C C
charge: 0.091417 0.384345 -0.218517 -0.000086 0.280516 -0.259644 0.000521 0.017716 0.219698 -0.515966
polarizability: 1.87815547e+02 -1.99898701e+00 1.02819688e+02 -1.05225692e-02 -2.89764948e-03 4.94231104e+01
1716.lowfreq: -0.0014 -0.0003 0.0006 1.4651 10.1304 14.2569 32.8335 65.1043 95.6115
frequency: 32.7966 65.0975 95.6050 97.8920 192.1048 199.9027 238.3138 245.1327 278.4673 369.2979 438.7003 469.8142 541.9980 587.7928 621.3804 669.0575 697.3015 793.1335 814.9737 866.7136 905.6984 926.8535 1008.4613 1065.7009 1070.2614 1094.7369 1196.8832 1227.0574 1244.1756 1305.3088 1327.6425 1397.1892 1438.4248 1447.4623 1469.8137 1478.9698 1531.6665 1573.4807 2973.6046 2999.1616 3021.6095 3095.5282 3105.1156 3178.3086 3202.0978
redmass: 2.4387 2.7761 17.1773 6.0864 1.2724 7.1795 3.9150 8.1698 4.9555 7.3922 5.5106 7.0227 2.9867 2.6628 8.0037 6.1150 4.9008 1.3020 1.3430 5.0095 1.4150 6.3964 1.5774 1.7325 1.6109 2.1975 1.8666 2.0328 1.1838 2.9865 2.1560 1.2077 1.1183 6.9939 1.0389 1.0546 5.6435 8.1822 1.0596 1.0365 1.0989 1.1002 1.1002 1.0917 1.0997
irintensity: 0.0027 1.2399 0.6863 1.4626 0.7485 0.2752 0.1214 0.9316 13.8231 0.0202 13.1473 12.6363 3.2015 2.9150 0.8288 2.7451 1.9114 66.7871 9.1357 26.8751 0.0420 89.1649 4.3747 18.6558 0.5170 6.5625 14.6783 121.1042 0.1479 6.7327 36.6813 27.5642 20.0270 249.1993 12.0679 11.8089 13.6782 163.9265 27.4082 29.9539 10.0268 26.1054 29.7058 3.4023 0.7208
temp: 298.150 k
press: 1.00000 atm
elementType: 35 16 8 6 6 6 6 6 6 6 1 1 1 1 1 1 1
symmnumber: 1
zpe: 314622.0 jmol-1
zpe.correction: 0.119833 hartree
zpe.thermalcorrener: 0.130553 hartree
zpe.thermalcorrenthalpy: 0.131497 hartree
zpe.thermalcorrgfe: 0.081090 hartree
zpe.sumelectzpe: -756.928953 hartree
zpe.sumelectthermal: -756.918233 hartree
zpe.sumelectthermalent: -756.917289 hartree
zpe.sumelectthermalfe: -756.967696 hartree
dipole: -0.0809 4.1220 -0.0007
dipole: 4.1228
quadrupole: -71.8082 -74.8827 -76.9482
quadrupole: 8.9636 -0.0038 -0.0009
quadrupole: 2.7381 -0.3363 -2.4018 8.9636 -0.0038 -0.0009
hfenergy: -757.048786 hartree
pointgroup: C01 [X(C7H7Br1O1S1)]
dipole: 0.1304664 -1.6167635 -0.0036539 debye
dipolederiv: -0.7150278 -0.0897833 0.0002554 -0.150506 -0.0250226 -0.0001034 0.0000901 -0.0001446 0.0665677 -0.0759353 -0.0166295 0.0001447 -0.1542511 -0.1758508 -0.0006865 -0.0001835 -0.0007878 0.2084579 -0.8646143 0.0679231 0.0005059 0.4689789 -0.7596889 -0.001265 0.001238 -0.0010922 -0.2960844 -0.1959404 -0.1304715 -0.0000695 -0.2633593 -0.1718677 -0.0008353 -0.0009357 -0.0010371 0.1498581 1.8080403 -0.0980746 -0.0010239 -0.3861678 0.7900233 0.0017198 -0.0013437 0.0016255 0.1457657 -0.9803933 0.344968 0.0011538 0.6056366 0.135671 0.0002744 0.0016645 0.0004389 -0.1704692 -0.0322051 0.0362145 0.0002748 -0.0247714 0.0656466 0.0000891 0.0001963 0.0001398 0.0628313 0.4008064 0.0608644 -0.000132 -0.2718201 -0.131673 0.0001198 -0.0008395 -0.0000931 -0.1024558 -0.6409438 -0.2249623 -0.0001501 -0.3578412 -0.1639534 0.0000502 -0.0004227 0.000014 -0.1037419 1.1386943 0.0727954 -0.0006346 0.4830862 0.3399646 0.0009646 0.0002217 0.0011854 -0.269614 -0.0105305 0.0411586 0.0697151 0.0449859 0.0245582 -0.0859952 0.0632332 -0.0998823 -0.0283778 -0.0108178 0.0421713 -0.0696867 0.0459044 0.023202 0.0862955 -0.0629602 0.1002187 -0.0266293 0.0814716 0.0084047 -0.0087793 0.0737048 0.0346288 0.1072093 -0.04127 0.0936329 -0.058368 -0.0965803 -0.1055828 -0.0001606 -0.1665424 -0.0568185 -0.0004677 -0.0003484 -0.0005409 0.103416 0.0812296 0.0080862 0.0084627 0.072912 0.0361641 -0.1067132 0.0415148 -0.0930271 -0.0604317 0.0608759 -0.076719 -0.0000784 -0.1032257 0.0154413 -0.0002621 -0.0001172 -0.0002652 0.1802515 0.0518705 0.0596368 0.0002026 0.0832762 0.019575 -0.0003944 0.0002623 -0.000385 0.1990239 unknown
polarizability: 187.7435673|3.1789252|102.8913907|-0.0775371|0.1101593|49.4233876 unknown
InChI: InChI=1S/C7H7BrOS/c1-2-5(9)6-3-4-7(8)10-6/h3-4H,2H2,1H3
charge 0 multiplicity 1
17 atoms
Br 4.279277 0.487204 -0.000742
S  1.15156 1.274866 0.00259
O  -1.863619 1.591795 0.005209
C  -2.576622 -0.760025 0.000292
C  -1.533383 0.366995 0.002227
C  -0.113163 -0.03117 0.000662
C  -4.022536 -0.234155 0.004716
C  0.472695 -1.299657 -0.002146
C  1.906932 -1.289104 -0.002943
C  2.420587 0.002837 -0.000699
H  -2.396655 -1.399075 -0.887859
H  -2.393467 -1.405406 0.883173
H  -4.215203 0.396038 -0.879813
H  -4.73847 -1.075442 0.002245
H  -4.212574 0.388477 0.895166
H  -0.113268 -2.221959 -0.003614
H  2.530811 -2.184415 -0.005065
