program: Gaussian 09
title: 000255119
version: EM64L-G09RevD.01
frameworkgroup: C1[X(C9H7F3O2S)]
method: RPBEPBE
basis: SDD
operation: Freq
keyword: #p
keyword: freq=noraman
keyword: PBEPBE/SDD
title: #p freq=noraman PBEPBE/SDD
converged: YES YES NO NO
title: Mulliken charges:
elementType: S F F F O O C C C C C C C C C H H H H H H H
charge: 0.356120 -0.153404 -0.126373 -0.173633 -0.180849 -0.112730 -0.289128 0.296291 -0.697191 0.123763 -0.278691 0.335181 -0.239200 -0.139181 -0.506005 0.259736 0.271604 0.232908 0.227367 0.260632 0.257017 0.275767
chargesum: 0.00000
title: Mulliken charges with hydrogens summed into heavy atoms:
elementType: S F F F O O C C C C C C C C C
charge: 0.356120 -0.153404 -0.126373 -0.173633 -0.180849 -0.112730 -0.029392 0.296291 0.034687 0.123763 -0.278691 0.335181 0.021432 0.117835 -0.230238
polarizability: 1.62501566e+02 -2.64215090e+01 1.12379648e+02 -5.15868042e+00 -1.93111681e+01 9.18560890e+01
1716.lowfreq: -7.0899 -1.6604 -0.0017 -0.0013 0.0005 6.4896 25.6084 28.2421 40.2302
frequency: 25.5369 28.1958 40.2043 57.5960 120.3447 143.5059 163.0742 182.3149 194.9068 208.9688 237.0380 272.6940 306.1648 342.9656 376.7375 434.0428 439.0786 454.9592 508.1105 558.8637 583.0462 624.9561 644.8217 684.5728 697.4650 724.5481 731.6492 794.1976 815.2495 846.9588 867.4425 925.2702 934.1180 980.5641 1016.2467 1050.5054 1069.1756 1078.7628 1091.2175 1112.1244 1169.3008 1197.4489 1238.9599 1249.0106 1311.2976 1344.7033 1390.7404 1451.2054 1466.6048 1474.4929 1521.2706 1583.6088 1652.3286 3006.8219 3056.0093 3104.4572 3127.6769 3178.6241 3195.2227 3234.1085
redmass: 10.5203 9.3279 12.3911 7.1750 11.6099 3.9898 6.4709 5.5009 1.1448 8.7667 3.7977 6.2062 8.9297 5.5996 14.3977 12.1515 6.7866 8.8012 12.3759 3.1143 7.7241 9.3260 8.5643 7.9221 5.0385 3.7757 1.2904 3.9747 4.5370 1.3962 5.9485 1.4052 4.3263 5.8607 2.3820 5.0310 1.6690 1.5796 1.1826 3.3117 3.3701 2.5620 1.6789 1.9936 1.5073 2.4389 1.1816 6.6068 1.0494 1.0483 5.4080 8.1220 11.3189 1.0355 1.0828 1.1012 1.1004 1.0900 1.0973 1.1004
irintensity: 0.8870 0.8642 0.2810 0.7289 1.9768 1.4020 1.0518 2.3112 0.7473 1.0206 0.4511 3.8091 3.5809 14.9466 2.9053 3.7724 4.7260 2.2489 2.0232 1.2695 2.9531 20.0936 6.9800 0.1124 5.6897 13.4751 96.5021 5.5291 44.6982 7.6993 45.1640 1.9144 173.4597 146.6560 69.4390 142.1658 70.6944 16.5794 20.3689 65.1661 65.2869 13.9158 75.5803 146.3154 4.6042 8.0105 27.9198 115.4546 14.2082 13.5625 27.4331 152.4666 202.8291 18.3787 3.5767 14.9936 4.9277 3.7565 1.3808 0.3696
temp: 298.150 k
press: 1.00000 atm
elementType: 16 9 9 9 8 8 6 6 6 6 6 6 6 6 6 1 1 1 1 1 1 1
symmnumber: 1
zpe: 372768.9 jmol-1
zpe.correction: 0.141980 hartree
zpe.thermalcorrener: 0.156816 hartree
zpe.thermalcorrenthalpy: 0.157760 hartree
zpe.thermalcorrgfe: 0.097661 hartree
zpe.sumelectzpe: -1194.055726 hartree
zpe.sumelectthermal: -1194.040890 hartree
zpe.sumelectthermalent: -1194.039946 hartree
zpe.sumelectthermalfe: -1194.100045 hartree
dipole: 3.8000 -1.6764 4.0064
dipole: 5.7707
quadrupole: -89.1617 -96.7338 -92.2013
quadrupole: -6.8754 -3.1857 3.0464
quadrupole: 3.5372 -4.0348 0.4976 -6.8754 -3.1857 3.0464
hfenergy: -1194.1977059 hartree
pointgroup: C01 [X(C9H7F3O2S1)]
dipole: 1.6568203 0.4029072 1.4990762 debye
dipolederiv: 0.1071305 0.0423479 0.0315221 0.024084 0.1665576 0.0244094 0.0915864 -0.0028399 -0.190261 -0.5033335 0.1585165 0.1580404 0.0903732 -0.5509474 -0.0915388 0.1620982 -0.0511021 -0.349016 -0.7689326 -0.234127 0.0517849 -0.372318 -0.4645731 0.0595052 0.1029976 0.0661274 -0.2619634 -0.3549121 -0.062979 -0.0953651 -0.0953774 -0.3843609 0.025576 -0.0827932 -0.0778751 -0.739634 -0.6057732 0.1458707 -0.043524 0.2142984 -0.3828541 0.0548919 -0.1166827 0.2120143 -0.8457821 -0.8947103 -0.0223095 -0.0989015 -0.0226699 -0.3890081 0.0752201 -0.4901747 0.0712845 -0.2674795 -1.0245986 -0.0089857 0.1232242 -0.0921026 -0.1735647 0.0231155 0.2133095 0.0394188 -0.0323939 1.6352015 -0.5122982 0.1737667 -0.7541402 0.3931772 -0.1642847 0.03243 -0.2767967 0.9510604 0.0374197 0.0089378 -0.0159335 -0.0252673 0.0793556 0.0385542 0.0165939 -0.0495287 0.023288 1.2473803 0.1706796 0.171267 0.4900332 0.5166193 -0.228284 0.6546522 -0.2272103 0.1557927 -0.5740996 0.2106809 -0.4725406 0.2625411 -0.2756413 0.2284938 -0.6588218 0.2641772 -0.1061196 1.5719984 0.0835323 -0.1540001 0.3027104 1.196667 0.0981945 -0.2439963 0.1845608 1.2835273 0.2583432 -0.1446598 0.0152013 -0.1664969 -0.0081563 -0.0337037 0.3602794 -0.1559018 -0.054907 -0.4359172 0.1004027 0.0911788 0.0964163 -0.1743666 -0.065185 0.2489937 -0.1159379 -0.0214347 -0.096643 -0.0862208 0.0296587 -0.0487258 -0.2255052 -0.0689884 -0.2735612 0.0521566 0.2585593 0.1424465 0.0090052 -0.0638456 -0.0396498 0.0540514 0.0519645 -0.0580925 0.0328751 -0.03859 0.1014162 0.0089405 -0.0206607 -0.0096357 0.0957364 -0.0395923 -0.0367977 0.0332145 -0.0301936 -0.0390667 0.0966899 0.0897902 0.0565311 0.0261663 -0.0161951 0.0855171 -0.0287992 0.0389962 -0.0277745 -0.1243124 -0.0324652 -0.08078 -0.001656 -0.0093036 -0.0350173 -0.0109264 0.0915927 0.0745845 0.0484149 0.0796495 0.0477769 0.160037 -0.0109245 0.1080009 -0.0281874 0.0619903 0.1007731 0.0429131 -0.0272234 0.0498174 0.1696301 0.0391107 -0.0675481 0.0525102 -0.0259906 0.0490676 0.0689602 0.0093758 0.0725815 0.1726359 0.0089644 -0.0129734 0.0167663 0.0989584 unknown
polarizability: 161.854833|-28.5736123|87.8801607|7.9863046|-12.223528|117.0023099 unknown
InChI: InChI=1S/C9H7F3O2S/c1-5(8(14)9(10,11)12)7(13)6-3-2-4-15-6/h2-5H,1H3
charge 0 multiplicity 1
22 atoms
S  3.19504 -0.282449 -1.229326
F  -0.823723 -1.778497 0.119812
F  -2.989314 -1.482681 0.730469
F  -1.327726 -0.638764 2.024713
O  0.557849 0.950288 -2.115573
O  -2.74353 0.729449 -0.859327
C  -0.540376 1.375717 0.032674
C  0.634938 0.829409 -0.860046
C  -0.863546 2.823761 -0.401664
C  -1.764377 0.47988 -0.131433
C  1.797755 0.243787 -0.194189
C  -1.744674 -0.860661 0.68031
C  2.052659 -0.021259 1.157335
C  3.328822 -0.626458 1.39555
C  4.059761 -0.828642 0.228243
H  -0.226905 1.34304 1.089434
H  -1.128694 2.84359 -1.469952
H  -1.712286 3.222318 0.179767
H  0.013621 3.473327 -0.240387
H  1.342281 0.193028 1.959131
H  3.692894 -0.904997 2.386642
H  5.052227 -1.264684 0.122017
