program: Gaussian 09
title: 000255097
version: EM64L-G09RevD.01
frameworkgroup: C1[X(C18H24N2O)]
method: RPBEPBE
basis: SDD
operation: Freq
keyword: #p
keyword: freq=noraman
keyword: PBEPBE/SDD
title: #p freq=noraman PBEPBE/SDD
converged: YES YES NO NO
title: Mulliken charges:
elementType: O N N C C C C C C C C C C C C C C C C C C H H H H H H H H H H H H H H H H H H H H H H H H
charge: -0.450064 -0.071252 -0.071364 0.298762 -0.447982 -0.591993 -0.592371 -0.386471 0.165340 0.165306 -0.709806 -0.316821 -0.317221 0.133343 0.133310 -0.188894 -0.188870 -0.305944 -0.305888 -0.789497 -0.789484 0.220919 0.220759 0.204154 0.247663 0.204239 0.247694 0.234850 0.234714 0.319746 0.209956 0.214744 0.209922 0.255010 0.255471 0.233032 0.233042 0.235788 0.235782 0.252214 0.227062 0.225914 0.227054 0.252210 0.225921
chargesum: 0.00000
title: Mulliken charges with hydrogens summed into heavy atoms:
elementType: O N N C C C C C C C C C C C C C C C C C C
charge: -0.130318 -0.071252 -0.071364 0.298762 -0.006304 -0.140177 -0.140438 0.083093 0.165340 0.165306 -0.075184 -0.061811 -0.061749 0.133343 0.133310 0.044138 0.044172 -0.070156 -0.070106 -0.084307 -0.084298
polarizability: 2.70815664e+02 -7.26532159e-02 2.04247491e+02 5.35239027e-02 -1.66714242e+01 1.50305230e+02
1716.lowfreq: -20.3587 -19.9410 -0.0005 -0.0003 0.0002 8.4688 9.5907 19.4114 22.6739
frequency: -20.2657 -19.7249 22.6647 23.3791 37.5932 40.8130 52.4835 93.1929 116.7063 121.1354 140.6582 186.8406 193.1160 200.5923 223.9996 225.8934 242.1615 243.3512 264.3185 328.3296 334.6327 375.5074 388.6377 396.7023 423.8032 433.6242 438.1295 477.5510 510.0904 527.3629 540.2426 546.0356 555.6102 626.5118 654.6446 712.8703 733.6833 749.3995 751.9568 756.8164 764.7315 810.7250 812.5427 838.5182 854.5871 897.5828 907.9161 910.7219 915.6699 926.8685 928.7624 954.6806 961.3035 985.5298 989.0105 991.0043 991.1440 1003.5441 1020.7537 1045.4823 1047.4631 1048.9236 1085.2851 1085.4522 1110.1377 1111.8953 1157.6910 1166.9020 1171.7344 1172.5412 1189.1879 1231.1858 1235.2252 1240.9963 1268.6946 1268.9607 1294.0070 1301.7786 1305.3674 1317.7239 1320.1471 1327.1824 1354.9374 1373.4045 1381.7261 1386.7769 1388.2173 1394.6636 1398.7008 1444.1842 1448.1218 1450.1261 1462.4636 1464.6971 1466.2951 1470.8017 1471.0395 1473.1726 1475.2874 1478.3720 1489.3370 1573.4931 1575.0561 1580.8832 1581.9974 2958.8271 2965.5192 2968.7311 2980.9224 2982.4250 2982.4837 2993.8157 3027.2489 3048.7625 3059.6949 3059.9754 3060.0182 3069.5502 3070.4345 3070.7427 3114.7067 3114.7797 3129.8635 3129.9087 3151.1641 3151.2705 3173.4400 3173.4994 3513.8548
redmass: 1.0348 1.0317 3.6524 3.6158 4.5304 3.0536 4.6545 2.1547 3.0370 3.5157 4.5664 3.2462 2.9973 4.2049 4.0461 1.3915 4.2008 3.5151 2.1558 2.7869 2.2502 1.2735 2.9302 1.8081 3.5742 3.4661 3.5657 2.1716 2.9982 4.9020 5.1862 5.1069 3.4615 6.0307 3.7297 4.8649 3.6129 1.3935 3.6521 1.2844 1.7037 2.7231 2.2011 1.7414 2.6065 1.6195 1.5007 1.4794 1.8591 2.3543 2.0912 4.7605 5.4210 2.0806 1.6765 1.4170 1.4134 1.7984 2.1249 2.1437 1.5847 1.9372 1.5657 1.5726 2.1731 1.9922 1.5202 1.2535 1.1311 1.1919 1.4341 1.9950 1.9952 1.2952 2.9631 3.2046 1.3666 1.1879 2.7027 2.3400 2.4197 2.3470 1.5005 1.8562 1.2144 1.4993 1.3192 1.9060 2.1367 1.7078 2.3269 1.3923 1.1513 1.1315 1.1389 1.0466 1.0476 1.0758 1.0427 1.0416 1.0916 6.4494 6.4941 5.5129 5.4553 1.0679 1.0669 1.0353 1.0598 1.0381 1.0381 1.0593 1.1001 1.1018 1.0923 1.0972 1.0973 1.0974 1.0938 1.1017 1.0981 1.0981 1.0874 1.0874 1.0953 1.0952 1.0972 1.0972 1.0654
irintensity: 0.3175 0.5862 0.1843 0.1200 0.5228 0.0494 1.0730 0.2215 3.5853 5.9064 0.4900 1.2063 5.6524 2.0739 10.5874 0.7887 3.0295 5.5065 0.2188 0.1499 4.6720 180.9098 10.5296 33.0525 1.9913 2.8056 1.4095 0.7968 14.1480 9.1029 3.0778 0.6105 0.6746 1.1054 2.5098 0.0476 3.4357 0.0088 7.8136 45.5014 55.2488 26.4604 5.6490 0.0111 27.1524 0.9326 2.0159 0.3295 6.1756 1.1307 0.0156 0.7023 0.5629 3.2002 0.8817 1.0236 1.0348 10.9540 26.8462 16.5940 4.3336 5.3646 15.0652 14.9868 12.4560 6.3632 4.9591 20.3257 1.9317 3.2571 20.0405 6.0505 5.4482 0.9922 1.7948 0.7031 13.0314 0.9608 5.2267 25.5822 46.5852 1.2071 2.8626 4.1855 10.7342 15.1708 23.8712 0.4194 9.8709 61.5239 38.4241 45.9021 1.1104 44.3466 29.5591 11.5995 23.3133 10.1607 6.7077 1.1330 17.7133 109.1124 23.1373 6.9609 64.0055 4.6614 70.4964 30.6068 3.5559 24.9095 22.9522 23.8917 5.0202 9.5597 12.3215 11.2851 29.2062 15.1708 43.1791 83.5395 8.9084 10.1035 4.6213 8.4625 36.4926 12.4645 2.4889 13.9955 2.2761
temp: 298.150 k
press: 1.00000 atm
elementType: 8 7 7 6 6 6 6 6 6 6 6 6 6 6 6 6 6 6 6 6 6 1 1 1 1 1 1 1 1 1 1 1 1 1 1 1 1 1 1 1 1 1 1 1 1
symmnumber: 1
zpe: 994072.8 jmol-1
zpe.correction: 0.378622 hartree
zpe.thermalcorrener: 0.398929 hartree
zpe.thermalcorrenthalpy: 0.399873 hartree
zpe.thermalcorrgfe: 0.327988 hartree
zpe.sumelectzpe: -883.475227 hartree
zpe.sumelectthermal: -883.454920 hartree
zpe.sumelectthermalent: -883.453976 hartree
zpe.sumelectthermalfe: -883.525861 hartree
dipole: 0.0012 -1.9229 0.6069
dipole: 2.0164
quadrupole: -105.4623 -118.5652 -128.8098
quadrupole: -0.0150 -0.0116 2.4542
quadrupole: 12.1501 -0.9528 -11.1973 -0.0150 -0.0116 2.4542
hfenergy: -883.8538493 hartree
pointgroup: C01 [X(C18H24N2O1)]
dipole: -0.0056466 0.7515901 0.2538722 debye
polarizability: 270.8135375|0.386118|203.5603383|-0.1637132|17.7374697|150.9945088 unknown
InChI: InChI=1S/C18H24N2O/c1-4-11-18(21,12-16-9-5-7-14(2)19-16)13-17-10-6-8-15(3)20-17/h5-10,21H,4,11-13H2,1-3H3
charge 0 multiplicity 1
45 atoms
O  -0.010906 2.045473 0.360017
N  -3.289368 -0.629954 -0.833887
N  3.309502 -0.580552 -0.836406
C  -0.000632 0.741521 -0.376071
C  0.007116 -0.323824 0.739302
C  -1.264768 0.665231 -1.293693
C  1.265293 0.684551 -1.292415
C  0.020112 -1.787639 0.240614
C  -2.599222 0.530093 -0.579349
C  2.601043 0.56733 -0.577212
C  0.03406 -2.783764 1.420786
C  -3.113197 1.530096 0.284392
C  3.098358 1.571246 0.291805
C  -4.51012 -0.827295 -0.245052
C  4.53263 -0.761487 -0.247162
C  -4.371571 1.326146 0.892018
C  4.359173 1.384123 0.899819
C  -5.083468 0.137711 0.624066
C  5.089904 0.208297 0.627045
C  -5.222194 -2.126792 -0.564945
C  5.265212 -2.048319 -0.571858
H  -0.881398 -0.155334 1.37739
H  0.891543 -0.140313 1.378913
H  -1.26738 1.57251 -1.934928
H  -1.17511 -0.204041 -1.967556
H  1.255801 1.592526 -1.932677
H  1.189015 -0.184813 -1.967834
H  -0.87332 -1.976836 -0.385046
H  0.913396 -1.959182 -0.390388
H  -0.01509 2.770831 -0.319233
H  0.928604 -2.634978 2.055071
H  0.043423 -3.829985 1.06332
H  -0.858839 -2.653208 2.061411
H  -2.521233 2.425753 0.488855
H  2.491742 2.4562 0.499931
H  -4.789289 2.083098 1.565069
H  4.764189 2.144296 1.577005
H  -6.063541 -0.048037 1.076671
H  6.072282 0.03586 1.079934
H  -4.609509 -2.720588 -1.260749
H  -5.398863 -2.72385 0.349364
H  -6.208478 -1.941427 -1.030233
H  5.450762 -2.646121 0.34019
H  4.662324 -2.648875 -1.270395
H  6.248714 -1.84558 -1.035797
