program: Gaussian 09
title: 000018236
version: EM64L-G09RevD.01
frameworkgroup: C1[X(C20H23NO3)]
method: RPBEPBE
basis: SDD
operation: Freq
keyword: #p
keyword: freq=noraman
keyword: PBEPBE/SDD
title: #p freq=noraman PBEPBE/SDD
converged: NO YES NO NO
title: Mulliken charges:
elementType: O O O N C C C C C C C C C C C C C C C C C C C C H H H H H H H H H H H H H H H H H H H H H H H
charge: -0.256990 -0.299531 -0.252013 -0.084093 -0.035353 -0.471363 -0.399826 -0.376873 -0.008759 -0.623649 0.185521 0.393196 0.362638 -0.374122 -0.357713 -0.403610 -0.391858 -0.531662 -0.235358 -0.237226 -0.225071 -0.238747 -0.247696 -0.241925 0.263599 0.224807 0.239784 0.242677 0.206871 0.197360 0.233776 0.191222 0.225255 0.225938 0.244026 0.262514 0.278677 0.257524 0.233734 0.246683 0.223366 0.223476 0.227315 0.222958 0.226594 0.225184 0.228741
chargesum: 0.00000
title: Mulliken charges with hydrogens summed into heavy atoms:
elementType: O O O N C C C C C C C C C C C C C C C C C C C C
charge: -0.256990 -0.299531 -0.252013 -0.084093 0.228246 -0.006772 0.049721 0.054263 -0.008759 0.018765 0.185521 0.393196 0.362638 -0.130096 -0.095199 -0.124933 -0.134334 0.172122 -0.011881 -0.009911 -0.002113 -0.012153 -0.022512 -0.013184
polarizability: 2.49545467e+02 -1.97575766e+01 2.24004784e+02 -1.52820032e+01 7.89178433e+00 1.95170283e+02
1716.lowfreq: -3.9528 -0.0009 -0.0006 -0.0004 6.9782 9.5296 14.3333 22.9866 36.7737
frequency: 12.0194 22.9094 36.7293 42.5369 49.7108 52.8730 66.0306 89.4060 104.1667 125.1506 145.7710 169.1832 186.6219 201.4154 226.3573 234.1022 246.7527 256.0661 272.4489 294.8092 301.1887 311.7225 333.8058 364.0001 402.2673 403.9076 404.3721 431.5797 456.0347 505.1993 541.2505 555.3170 615.6592 616.2201 639.1556 652.1637 668.2845 700.6027 704.6374 705.7577 745.3374 762.6551 768.2245 791.0487 817.5190 854.7432 858.6157 879.8607 888.1551 915.8337 921.8881 937.3580 940.3387 946.2780 970.0567 980.0480 983.8799 990.3581 991.5150 995.3747 997.4737 998.4341 1003.5737 1030.4194 1032.4852 1042.6902 1069.4163 1084.1776 1085.1044 1090.6947 1115.2749 1124.3186 1142.5489 1148.9567 1157.1721 1170.9606 1173.5526 1177.3551 1189.3722 1190.2941 1197.0715 1204.4380 1221.0100 1234.1437 1237.1029 1270.4014 1302.5832 1311.5648 1317.8626 1325.3390 1334.9867 1356.5354 1379.3048 1383.1529 1429.0525 1432.8919 1434.4263 1436.0008 1447.4962 1454.3401 1463.8078 1471.9541 1479.4664 1480.6661 1482.3573 1483.9267 1491.0507 1589.5650 1591.3587 1594.3357 1610.4917 1613.9572 2852.1961 2860.2051 2874.4715 2975.1093 3019.3914 3028.0149 3042.8740 3046.2848 3068.5928 3073.0985 3075.7870 3104.6592 3110.2256 3120.3365 3124.3887 3129.4117 3133.7275 3142.1796 3146.4719 3158.2477 3160.0487 3174.6159 3181.0096
redmass: 4.2990 4.1098 3.6749 3.9772 3.9704 4.1020 4.2201 3.8793 1.8273 2.9618 2.9201 3.2715 3.1316 2.7085 4.2626 1.2156 3.2542 4.0369 4.4794 2.4890 4.8888 2.2863 7.8512 4.1286 2.8359 3.1587 2.8837 4.2420 4.0600 3.8910 3.8710 3.3462 6.3997 6.3997 5.5317 4.6591 3.4536 4.3424 1.7874 2.1594 3.0170 1.9902 2.3543 3.9308 3.8827 1.2584 1.2530 4.7334 2.2010 2.4605 1.8988 1.8204 2.0066 3.3903 4.4310 1.4114 1.3980 5.9467 5.4149 1.5535 1.4013 1.3774 6.8447 2.2052 2.0798 1.7306 1.8063 1.8177 1.5878 1.6275 1.4512 1.2591 2.0571 1.6978 2.2652 1.0536 1.0538 1.4444 1.3572 1.2241 1.1994 3.0459 1.8141 2.7231 3.5579 1.5199 1.3483 1.2987 1.3183 1.3261 1.4839 1.4632 8.2139 9.3328 1.2051 1.1672 2.2236 1.9940 1.0898 1.0528 1.0545 1.0712 1.0621 2.2100 2.1833 1.0588 1.0947 7.2058 7.4010 6.9205 5.9734 6.1544 1.0590 1.0708 1.0692 1.0300 1.0724 1.0658 1.0873 1.0874 1.1035 1.0894 1.1010 1.1032 1.1023 1.0845 1.0847 1.0885 1.0884 1.0941 1.0940 1.0995 1.0981 1.0967 1.0949
irintensity: 0.4043 0.1511 0.2425 0.2182 1.0126 0.3477 0.3213 0.2526 2.6621 0.6975 1.9931 1.2092 1.4393 1.3898 0.6258 0.3934 6.7310 3.9129 21.7688 14.7826 4.4202 1.1106 1.5071 0.7765 0.0370 4.1582 0.0526 5.1108 3.5991 9.3999 2.8785 1.5658 0.0330 0.0789 20.8563 14.7126 2.8990 20.3430 50.3161 43.4590 21.6720 40.4359 56.8851 1.2105 2.6685 0.8331 0.3262 6.1893 21.6518 27.5649 3.1615 4.3540 3.3004 13.6978 116.3638 0.5195 0.8096 4.2726 2.7352 9.0435 7.4313 5.9544 80.7124 3.0130 3.7202 13.0195 23.7839 0.4746 2.2632 15.1297 14.4494 1.6710 126.6572 19.1216 210.6847 0.3614 0.0617 11.6090 2.4749 6.5688 4.5931 33.1713 9.0082 13.6746 5.6771 10.7029 2.1557 6.4299 2.1512 3.0711 2.7223 0.8773 0.0914 0.3312 11.5127 0.6292 11.7690 12.2905 14.7230 6.4034 24.1942 4.0959 3.4488 21.9248 16.1717 8.0261 12.5742 73.1340 60.4772 32.9955 0.8485 1.2159 74.1651 64.7263 149.4544 54.9944 55.6032 11.6152 28.0158 42.9873 35.6804 24.1014 29.4628 22.2919 18.7240 0.8723 0.2714 6.6097 6.8239 33.3102 24.2757 30.5823 29.6317 8.8536 5.8244
temp: 298.150 k
press: 1.00000 atm
elementType: 8 8 8 7 6 6 6 6 6 6 6 6 6 6 6 6 6 6 6 6 6 6 6 6 1 1 1 1 1 1 1 1 1 1 1 1 1 1 1 1 1 1 1 1 1 1 1
symmnumber: 1
zpe: 1009501.9 jmol-1
zpe.correction: 0.384499 hartree
zpe.thermalcorrener: 0.407332 hartree
zpe.thermalcorrenthalpy: 0.408277 hartree
zpe.thermalcorrgfe: 0.329655 hartree
zpe.sumelectzpe: -1054.548435 hartree
zpe.sumelectthermal: -1054.525601 hartree
zpe.sumelectthermalent: -1054.524657 hartree
zpe.sumelectthermalfe: -1054.603279 hartree
dipole: -0.1488 0.5678 0.0989
dipole: 0.5952
quadrupole: -129.6932 -140.2287 -133.0621
quadrupole: -4.7267 -3.9659 -2.3390
quadrupole: 4.6348 -5.9007 1.2659 -4.7267 -3.9659 -2.3390
hfenergy: -1054.9329338 hartree
pointgroup: C01 [X(C20H23N1O3)]
dipole: -0.0330374 0.2218258 0.0674061 debye
polarizability: 243.4883232|-19.2366911|225.3950961|-19.4705198|14.0035346|199.8371148 unknown
InChI: InChI=1S/C20H23NO3/c1-21-14-13-18(15-21)24-19(22)20(23-2,16-9-5-3-6-10-16)17-11-7-4-8-12-17/h3-12,18H,13-15H2,1-2H3
charge 0 multiplicity 1
47 atoms
O  -1.462982 -0.044877 -0.533607
O  0.583033 -0.873411 1.761053
O  -0.62852 -2.20312 -0.725489
N  -4.847094 -0.518649 0.162788
C  -2.784624 -0.528826 -1.071261
C  -3.612534 0.734061 -1.396354
C  -3.573161 -1.27272 0.042888
C  -4.528997 0.893433 -0.164957
C  0.779891 -0.440666 0.341345
C  -5.578583 -0.741311 1.416083
C  -0.473022 -1.000093 -0.392899
C  0.785361 1.098987 0.381825
C  2.110376 -0.975959 -0.214311
C  1.263941 1.8273 -0.734808
C  3.278709 -0.707227 0.547556
C  0.29228 1.801164 1.506464
C  2.236323 -1.67159 -1.440008
C  0.716704 -2.315846 2.036481
C  1.245197 3.238626 -0.729995
C  4.545204 -1.130131 0.097274
C  0.283859 3.214111 1.514982
C  3.509697 -2.085904 -1.897844
C  0.754886 3.939181 0.396645
C  4.666303 -1.820464 -1.133097
H  -2.566693 -1.167949 -1.941915
H  -4.223602 0.548977 -2.296448
H  -2.957964 1.601901 -1.576756
H  -3.75991 -2.332589 -0.201243
H  -2.969328 -1.2365 0.984328
H  -3.980448 1.412811 0.661225
H  -5.451937 1.460532 -0.378961
H  -5.006143 -0.42175 2.324352
H  -5.817083 -1.814694 1.52555
H  -6.532154 -0.183869 1.396853
H  1.662295 1.292829 -1.604839
H  3.180222 -0.162585 1.493495
H  -0.070906 1.234556 2.367081
H  1.34887 -1.909795 -2.03239
H  1.729051 -2.680961 1.783201
H  -0.033397 -2.908259 1.48148
H  0.546142 -2.402956 3.121276
H  1.618933 3.790396 -1.600051
H  5.436552 -0.917303 0.698089
H  -0.093725 3.748619 2.394372
H  3.593302 -2.622944 -2.849373
H  0.745671 5.035158 0.404017
H  5.650304 -2.146094 -1.488896
