program: Gaussian 09
title: 000255064
version: EM64L-G09RevD.01
frameworkgroup: C1[X(C6H10BrClN2O2)]
method: RPBEPBE
basis: SDD
operation: Freq
keyword: #p
keyword: freq=noraman
keyword: PBEPBE/SDD
title: #p freq=noraman PBEPBE/SDD
converged: YES YES NO NO
title: Mulliken charges:
elementType: Br Cl O O N N C C C C C C H H H H H H H H H H
charge: -0.026106 -0.077214 -0.190644 -0.222658 -0.392041 -0.464535 -0.330482 -0.501233 0.268497 0.314724 -0.551157 -0.648026 0.250188 0.268700 0.274800 0.248229 0.305841 0.312764 0.287584 0.272381 0.308182 0.292205
chargesum: 0.00000
title: Mulliken charges with hydrogens summed into heavy atoms:
elementType: Br Cl O O N N C C C C C C
charge: -0.026106 -0.077214 -0.190644 -0.222658 -0.086200 -0.151771 0.188406 0.021796 0.268497 0.314724 0.008808 -0.047639
polarizability: 1.53844007e+02 5.39850792e+00 1.02975827e+02 -2.11238897e-01 1.11472354e+01 7.30077316e+01
1716.lowfreq: -6.2644 -2.5567 -0.0015 -0.0008 0.0013 3.3941 10.7724 20.2091 31.3847
frequency: 9.8566 20.1443 31.1787 50.2300 60.4100 70.6897 107.8253 127.3585 171.4076 208.2354 233.5371 296.6386 341.6426 394.0909 469.6624 539.5902 544.1325 556.8936 593.7280 605.9690 679.9050 698.5359 750.0003 772.6833 832.6532 918.4893 939.8093 962.1602 985.2908 1029.5595 1078.2533 1110.2806 1121.6768 1152.1051 1165.5607 1208.4106 1227.0129 1240.5664 1274.1083 1300.0122 1321.5631 1367.9334 1431.9208 1441.0208 1442.5984 1447.7261 1453.5640 1479.5179 1641.6663 1684.3218 2992.5704 3005.4819 3048.1549 3062.2549 3071.8003 3081.8684 3156.8185 3169.2860 3514.6006 3532.1864
redmass: 3.4724 4.9576 4.7791 6.5284 5.9366 4.8660 4.0730 4.9952 8.7463 6.5461 5.5999 4.7442 2.9352 4.3843 2.4544 1.4085 4.7422 3.1106 2.7703 1.4439 4.2525 6.5723 3.9277 1.3260 2.2490 4.6816 2.9817 1.5375 2.5973 1.7697 3.7997 1.7533 1.9000 1.8080 1.4257 1.6185 1.2722 1.4568 1.1567 1.1771 1.5773 1.3021 1.7831 1.1369 1.1023 1.1392 1.0977 1.7074 5.0254 9.1540 1.0597 1.0595 1.1010 1.0779 1.0814 1.0573 1.1122 1.1110 1.0770 1.0773
irintensity: 4.4183 1.0174 5.7823 2.6999 3.8013 8.2902 12.8293 3.4839 1.3946 5.0155 1.8767 1.1331 3.8612 18.7787 11.9063 68.2585 33.2378 8.0853 20.9004 159.6119 24.4860 19.4459 23.1836 14.8666 22.0064 14.3335 10.7672 0.7161 20.5256 2.4219 0.7065 38.2555 5.6224 262.7530 70.3164 36.5542 22.4374 104.5980 0.7077 50.3341 50.9017 3.8395 499.8570 71.2413 38.9315 97.5726 11.1611 271.8342 28.5466 315.3512 17.3622 35.4755 7.3888 7.1841 14.4932 5.6664 12.5120 3.4438 7.5383 37.9593
temp: 298.150 k
press: 1.00000 atm
elementType: 35 17 8 8 7 7 6 6 6 6 6 6 1 1 1 1 1 1 1 1 1 1
symmnumber: 1
zpe: 432014.3 jmol-1
zpe.correction: 0.164546 hartree
zpe.thermalcorrener: 0.178774 hartree
zpe.thermalcorrenthalpy: 0.179718 hartree
zpe.thermalcorrgfe: 0.116897 hartree
zpe.sumelectzpe: -967.194369 hartree
zpe.sumelectthermal: -967.180141 hartree
zpe.sumelectthermalent: -967.179196 hartree
zpe.sumelectthermalfe: -967.242017 hartree
dipole: 2.9055 -2.7994 -2.5748
dipole: 4.7862
quadrupole: -89.4734 -100.9457 -86.5375
quadrupole: 3.3991 -2.8397 -1.4139
quadrupole: 2.8455 -8.6269 5.7814 3.3991 -2.8397 -1.4139
hfenergy: -967.3589142 hartree
pointgroup: C01 [X(C6H10Br1Cl1N2O2)]
dipole: -1.2153057 1.2335736 -0.7397424 debye
dipolederiv: -0.504061 -0.1122333 -0.0011743 -0.2039074 -0.2152073 0.0135827 0.0640548 0.0348606 -0.1534979 -0.2626453 0.030878 0.0428223 0.1283914 -0.5147018 -0.1524101 0.0826561 -0.0772188 -0.2536835 -0.7478874 -0.0176794 -0.0415349 0.35228 -0.6263846 0.2753361 -0.2665535 0.2289899 -0.4779975 -0.7354546 -0.0557682 0.0178452 -0.0260672 -0.936157 -0.0412909 0.0835394 -0.0186735 -0.3031519 -1.3906475 0.3260494 0.0459801 0.4156004 -0.522492 0.0753596 -0.0356309 0.1103918 -0.5505264 -2.2763632 0.0101311 -0.2423172 -0.2184685 -0.4399911 -0.0671921 -0.2961059 -0.0190393 -0.418447 0.6375542 -0.050286 0.0192772 0.332427 -0.1203937 -0.089001 0.0608763 -0.0604828 0.2210024 -0.3543144 -0.1298183 -0.0136558 -0.3633812 -0.1109207 0.1093128 0.2399461 0.2016077 0.0026841 1.9550927 -0.0291645 0.2605847 -0.4872405 0.7727667 -0.4566116 0.4274359 -0.4098786 0.544602 2.4556402 -0.1890853 0.076289 0.0460727 1.4092154 0.0941963 -0.0650663 -0.0262488 0.2634418 0.1385241 -0.0758994 -0.0361505 -0.1974561 0.7174824 0.1555289 -0.0669972 0.1827495 0.181409 0.6973585 0.2848238 -0.082538 0.3446419 0.2616602 -0.0458673 -0.131621 -0.0719243 0.1354236 -0.1045419 0.0347081 -0.0545741 0.0196064 0.0999192 0.1124055 -0.0770931 0.0551099 -0.0455161 0.145097 0.0616998 0.0430689 -0.1008019 0.0301818 -0.0165309 0.0488751 -0.0475469 0.0961636 0.0532848 -0.0236904 0.0108035 0.0046735 0.0879175 -0.0165397 -0.0357071 -0.0180977 -0.0682841 0.0215743 0.0609269 0.0157927 0.0915548 -0.0718562 -0.0056343 -0.0212552 -0.0314037 0.0948249 0.1842346 -0.011584 -0.0485558 -0.1093121 0.1380126 -0.0327926 -0.0603242 -0.057694 0.348754 0.1458245 -0.0066907 -0.0471182 -0.0088877 0.116114 0.0836452 0.0364808 0.0818112 0.2866953 0.0874926 0.0499506 -0.0712631 0.049411 -0.0482971 0.0220883 -0.0329029 0.0041337 -0.0269736 -0.1217361 -0.0351813 0.0070517 -0.0245757 -0.0319061 -0.0287646 0.0171945 -0.0537663 0.0960773 -0.0008986 -0.0639777 0.0264508 0.0045771 -0.0523022 -0.0028622 0.0131804 -0.001339 0.0867231 -0.0231273 -0.0581093 0.0729158 -0.0491379 0.0573401 0.0140419 0.0150181 -0.0063409 -0.059723 unknown
polarizability: 153.3576295|7.0335314|106.6383698|-0.8951372|-4.5678912|69.831566 unknown
InChI: InChI=1S/C6H10BrClN2O2/c7-2-1-5(11)10-6(12)9-4-3-8/h9-10H,1-4H2
charge 0 multiplicity 1
22 atoms
Br 5.570599 1.254891 -0.093679
Cl -4.339326 1.922784 0.883329
O  1.660709 -1.432477 0.681632
O  -1.051906 -1.814706 -0.452368
N  -1.99984 0.318826 -0.619111
N  0.330921 0.125394 -0.485794
C  -3.374853 -0.179027 -0.719462
C  2.755499 0.513473 -0.355658
C  1.552443 -0.378226 0.011439
C  -0.928612 -0.566513 -0.498318
C  -4.186258 0.054913 0.555952
C  3.992309 0.102754 0.447629
H  -3.886409 0.287582 -1.581164
H  -3.30935 -1.268657 -0.898109
H  2.957862 0.408184 -1.43918
H  2.520219 1.580023 -0.175636
H  -1.881954 1.31436 -0.415586
H  0.360762 1.043587 -0.937688
H  -3.697005 -0.358398 1.44926
H  -5.220498 -0.306712 0.460882
H  4.295161 -0.933607 0.248976
H  3.869629 0.260049 1.528155
