program: Gaussian 09
title: 000255058
version: EM64L-G09RevD.01
frameworkgroup: C1[X(C8H2I4N2O2)]
method: RPBEPBE
basis: SDD
operation: Freq
keyword: #p
keyword: freq=noraman
keyword: PBEPBE/SDD
title: #p freq=noraman PBEPBE/SDD
converged: YES YES NO NO
title: Mulliken charges:
elementType: I I I I O O N N C C C C C C C C H H
charge: 0.235177 0.232178 0.234719 0.234113 -0.149730 -0.176763 -0.218177 -0.494270 0.336114 0.347001 0.153116 0.116253 -0.458790 -0.456545 -0.285968 -0.287159 0.319350 0.319381
chargesum: 0.00000
title: Mulliken charges with hydrogens summed into heavy atoms:
elementType: I I I I O O N N C C C C C C C C
charge: 0.235177 0.232178 0.234719 0.234113 -0.149730 -0.176763 -0.218177 0.144461 0.336114 0.347001 0.153116 0.116253 -0.458790 -0.456545 -0.285968 -0.287159
polarizability: 3.05089419e+02 -1.11871539e+00 2.84981201e+02 1.39206267e-02 -8.55348308e-03 7.20733793e+01
1716.lowfreq: -23.9950 -3.7867 -0.0002 0.0001 0.0002 3.2281 4.7267 22.0050 23.2672
frequency: -23.9227 21.9975 23.2501 58.4002 90.9690 110.8254 111.7101 122.5048 132.6704 134.5898 152.0927 154.7724 211.4309 213.1409 271.7623 286.5622 303.3052 308.4933 366.0829 466.3673 521.9693 533.1565 560.0142 566.6013 600.4235 610.4479 673.9238 728.2176 733.4898 771.5641 785.9358 858.8695 1006.7363 1075.6115 1082.8863 1125.1083 1260.9590 1262.4926 1273.2762 1337.6853 1363.4721 1517.6365 1523.0721 1639.1523 1658.4863 1698.2827 3454.5822 3589.4955
redmass: 1.1801 18.4517 44.7797 12.1944 5.4475 60.7636 96.2594 122.4492 10.0142 13.1114 98.8545 110.0124 4.8101 16.5741 10.4007 3.7636 8.7235 11.9017 12.1102 12.1678 11.8336 3.6576 11.8921 2.3009 9.6761 12.2017 11.7781 11.3519 12.3919 10.2332 11.6852 12.2221 8.7414 12.1091 13.0374 11.3038 1.1946 11.9858 11.9971 11.9838 9.1508 11.9804 11.9794 3.1817 1.8487 4.4604 1.0417 1.1036
irintensity: 42.0082 0.0686 0.4955 1.1027 9.3205 1.0347 0.4890 0.0475 0.8079 0.8587 0.2774 0.0135 0.3593 0.1224 3.1715 30.6780 10.6286 0.6446 23.1383 7.3131 0.1788 74.4257 4.0649 77.5686 30.8281 76.3357 0.2083 11.6500 6.5317 13.3138 0.1332 15.8944 25.3690 38.7767 35.9158 311.9634 0.4461 9.9683 238.5017 38.0070 102.6813 3.4909 6.6711 191.7264 194.5960 104.3134 11.9284 14.9971
temp: 298.150 k
press: 1.00000 atm
elementType: 53 53 53 53 8 8 7 7 6 6 6 6 6 6 6 6 1 1
symmnumber: 1
zpe: 223429.4 jmol-1
zpe.correction: 0.085100 hartree
zpe.thermalcorrener: 0.101254 hartree
zpe.thermalcorrenthalpy: 0.102198 hartree
zpe.thermalcorrgfe: 0.035440 hartree
zpe.sumelectzpe: -610.866731 hartree
zpe.sumelectthermal: -610.850577 hartree
zpe.sumelectthermalent: -610.849632 hartree
zpe.sumelectthermalfe: -610.916390 hartree
dipole: -1.1383 -1.2197 -0.0008
dipole: 1.6683
quadrupole: -150.5113 -137.5072 -147.4763
quadrupole: -7.9686 -0.0067 -0.0025
quadrupole: -5.3464 7.6578 -2.3114 -7.9686 -0.0067 -0.0025
hfenergy: -610.9518305 hartree
pointgroup: C01 [X(C8H2I4N2O2)]
dipole: 0.479241 -0.4484838 -0.0001373 debye
dipolederiv: 0.2003186 0.0734702 -0.0000213 -0.0320794 -0.5020743 0.0000584 0.000059 0.0000837 0.1006586 0.1921198 -0.0624128 0.0000024 0.0439942 -0.5057355 -0.0000588 0.0000433 -0.0000432 0.098396 -0.3613495 -0.3249878 -0.0003963 -0.3445311 -0.0087086 -0.0002733 -0.0003071 -0.0002112 0.1033184 -0.3676912 0.3167262 -0.0001508 0.3318997 0.0015436 0.0001529 -0.0003078 0.0003048 0.1030525 -0.6655261 0.2127294 -0.0004191 0.275764 -0.8373368 0.000809 0.0001828 -0.0009219 -0.2815332 -0.7255431 -0.2710182 -0.0003771 -0.2945385 -0.8608603 -0.0007395 0.0001972 0.000851 -0.299664 -0.3362143 -0.0320691 -0.000583 0.1409511 -0.9713331 -0.0002026 -0.0001754 0.0001524 -0.1997867 -0.3155008 0.1024639 0.0000946 0.1553118 -0.411448 -0.0000654 0.0008451 0.0000791 -0.0440018 -0.6616007 0.1291006 -0.0001188 0.3463068 -0.3609557 0.0001881 -0.0010543 -0.0003466 0.0460186 -0.7002746 -0.1773992 -0.0001151 -0.3408237 -0.3749915 -0.0003061 -0.0007641 0.0001825 0.0441721 1.375935 0.1323314 0.000626 -0.1105674 1.2920221 -0.0009101 0.0007056 0.0002225 0.2506572 1.3074897 -0.068266 0.0006165 0.1772143 1.2607775 0.0009252 0.0006998 -0.0002246 0.2305808 -0.3260475 -0.1669432 -0.0000418 -0.0915622 1.1625055 -0.0001198 -0.0003252 0.0000652 -0.1180806 -0.2934702 0.1736069 -0.0000353 0.0702885 1.156269 0.0003168 -0.0005374 0.0000276 -0.1166945 0.6848338 0.7578935 0.0005665 0.7346768 -0.2215937 0.0004763 0.0006227 0.0004979 -0.101877 0.6935856 -0.7504288 0.0004333 -0.7279401 -0.2763447 -0.000493 0.0006976 -0.0005844 -0.1021086 0.1494715 -0.0225028 0.0375697 -0.1675022 0.2292011 -0.1189596 0.075303 -0.0508128 0.1433761 0.1494641 -0.022294 -0.0376504 -0.1668626 0.2290633 0.1192013 -0.0758847 0.0506778 0.1435161 unknown
polarizability: 284.9842734|1.1462776|305.0863121|0.0846652|0.0187943|72.0734132 unknown
InChI: InChI=1S/C8H2I4N2O2/c9-3-1-2(4(10)6(12)5(3)11)8(16)14(13)7(1)15/h13H2
charge 0 multiplicity 1
18 atoms
I  0.74912 3.574713 -0.000279
I  0.812207 -3.590859 -0.000378
I  3.940615 1.825047 0.001617
I  3.975427 -1.783181 0.001541
O  -2.229755 2.322854 -0.000167
O  -2.208476 -2.379954 -0.000494
N  -2.547414 -0.038765 -0.000751
N  -3.944658 -0.039246 0.001223
C  -0.335323 0.693222 -0.001208
C  -0.319364 -0.729335 -0.001224
C  -1.771511 1.164819 -0.002165
C  -1.741269 -1.218531 -0.001992
C  0.856896 1.437333 -0.000356
C  0.885952 -1.452081 -0.000428
C  2.099441 0.720709 0.000375
C  2.114193 -0.712882 0.000331
H  -4.343825 -0.425564 -0.85966
H  -4.341457 -0.4253 0.863319
