program: Gaussian 09
title: 000255046
version: EM64L-G09RevD.01
frameworkgroup: C1[X(C8H18N8O4)]
method: RPBEPBE
basis: SDD
operation: Freq
keyword: #p
keyword: freq=noraman
keyword: PBEPBE/SDD
title: #p freq=noraman PBEPBE/SDD
converged: YES YES NO NO
title: Mulliken charges:
elementType: O O O O N N N N N N N N C C C C C C C C H H H H H H H H H H H H H H H H H H
charge: -0.491948 -0.486946 -0.429580 -0.440211 -0.278088 -0.120754 -0.153158 -0.149532 -0.622288 -0.625916 -0.619673 -0.616538 -0.210918 -0.110499 -0.240137 -0.319373 0.267412 -0.389585 0.263694 0.278447 0.272728 0.217240 0.250274 0.199552 0.204368 0.350555 0.366924 0.339921 0.280327 0.356459 0.311128 0.337321 0.314516 0.352653 0.317811 0.343696 0.312094 0.368022
chargesum: 0.00000
title: Mulliken charges with hydrogens summed into heavy atoms:
elementType: O O O O N N N N N N N N C C C C C C C C
charge: -0.141393 -0.120022 -0.089659 -0.083751 -0.278088 -0.120754 -0.153158 -0.149532 0.026162 0.041254 0.041835 0.063578 0.061810 0.106741 0.010137 0.084546 0.267412 -0.109258 0.263694 0.278447
polarizability: 3.64124673e+02 -1.91297694e+01 1.69105787e+02 -1.67434744e+00 2.52956311e+01 1.16569275e+02
1716.lowfreq: -8.1907 -4.1576 -0.0006 -0.0004 -0.0002 2.6918 10.7387 32.1269 36.3675
frequency: 10.0141 32.1052 36.3548 43.9314 54.2621 56.2171 86.5173 96.5060 106.9395 129.6033 146.8677 159.8131 178.1151 211.5592 211.8826 234.0400 244.6837 250.1982 266.8025 284.0489 324.4692 331.5351 355.0677 378.0885 409.6367 414.4703 424.9242 429.5934 442.1645 449.5542 478.2107 509.2340 524.5624 526.9658 542.8954 566.1696 580.3270 601.2752 625.6576 647.7962 653.0927 663.7192 673.5131 685.7761 717.8899 755.8824 829.6566 871.6242 882.3479 897.9814 927.4271 938.7912 947.1749 955.8965 962.3596 998.7904 1009.3329 1022.7151 1037.1066 1048.2032 1051.3932 1068.1159 1093.5293 1125.4311 1155.2147 1172.7073 1210.6662 1227.3073 1244.0358 1267.8113 1294.6272 1313.3874 1324.1178 1327.0690 1361.2501 1380.0981 1389.8710 1397.9295 1465.4458 1469.4974 1481.5271 1489.6258 1502.0497 1515.1493 1547.3073 1567.5183 1591.1099 1602.6076 1623.1573 1632.4776 2848.1504 2962.0770 2980.9230 3056.1784 3067.6909 3097.2468 3106.8629 3401.9326 3479.0264 3487.2771 3517.3244 3537.3561 3547.2294 3559.7132 3679.6718 3684.8493 3695.8898 3713.8939
redmass: 6.4350 4.9439 4.6499 5.5102 4.1973 5.0429 5.5578 5.2331 5.8958 5.8889 3.4270 1.4007 4.2690 3.8154 3.9499 4.5337 4.7730 3.5706 2.2880 1.6487 4.3255 3.6073 3.0973 2.5447 1.7406 2.5636 1.3077 1.6590 2.1992 3.1523 3.1218 3.2186 1.1958 1.3023 1.2046 3.4150 1.6191 2.1886 1.5130 2.5088 2.5479 3.7649 4.8958 5.2661 1.7220 3.8952 3.7319 3.1717 1.5704 1.8531 4.1702 4.3405 4.6686 1.4679 3.4294 3.1310 1.5946 1.8567 1.8886 2.5697 2.3567 3.2205 2.2012 3.8141 3.1511 1.2248 1.1626 1.5031 1.2809 1.3524 1.2957 1.7434 1.2770 1.2487 2.7725 1.2095 1.2028 1.5614 3.7186 1.0975 3.3993 1.3022 2.7541 2.1655 3.5891 2.6164 1.8660 1.4663 1.4430 1.5345 1.0683 1.0720 1.0798 1.0860 1.0963 1.0853 1.0889 1.0640 1.0643 1.0490 1.0653 1.0447 1.0452 1.0454 1.0994 1.1037 1.1039 1.1048
irintensity: 2.9898 0.9288 4.8527 0.5428 2.2978 3.8394 4.2503 2.0455 0.8784 5.5986 12.7502 7.6121 6.3418 5.6343 12.2887 24.3941 7.2731 24.8120 89.9569 78.0702 4.1589 24.7089 76.0137 17.6440 71.9562 43.2961 157.2205 323.7946 104.2769 29.2733 22.0623 9.1935 35.5865 124.1957 174.0156 44.8109 119.5666 92.1537 46.9098 18.7254 92.7820 17.8393 97.5063 18.0565 136.2752 12.5294 21.7858 36.2313 124.5337 30.5397 78.3262 76.4876 86.9744 30.0197 88.2479 27.1759 3.5860 2.8723 8.1088 56.7032 16.5994 75.8359 1.8786 444.5630 8.2269 19.1752 58.2893 10.9453 8.4794 21.4162 28.9522 17.5950 93.3885 5.6705 157.3470 23.6353 50.7363 60.8021 896.1177 14.9705 224.5162 166.5562 56.2385 32.4317 952.9992 141.4884 429.2161 364.9718 710.3799 194.0460 690.9426 27.6340 101.0159 5.2146 36.8680 9.1378 6.8241 46.7860 15.6325 35.8290 7.1346 47.5282 77.0764 144.9452 98.4371 56.7486 30.3635 49.5011
temp: 298.150 k
press: 1.00000 atm
elementType: 8 8 8 8 7 7 7 7 7 7 7 7 6 6 6 6 6 6 6 6 1 1 1 1 1 1 1 1 1 1 1 1 1 1 1 1 1 1
symmnumber: 1
zpe: 784736.3 jmol-1
zpe.correction: 0.298890 hartree
zpe.thermalcorrener: 0.321810 hartree
zpe.thermalcorrenthalpy: 0.322754 hartree
zpe.thermalcorrgfe: 0.244641 hartree
zpe.sumelectzpe: -1052.922649 hartree
zpe.sumelectthermal: -1052.899729 hartree
zpe.sumelectthermalent: -1052.898785 hartree
zpe.sumelectthermalfe: -1052.976898 hartree
dipole: -0.7772 -6.8855 -1.3574
dipole: 7.0609
quadrupole: -42.8924 -123.6716 -127.7870
quadrupole: -8.7000 1.3869 8.6886
quadrupole: 55.2246 -25.5546 -29.6700 -8.7000 1.3869 8.6886
hfenergy: -1053.2215391 hartree
pointgroup: C01 [X(C8H18N8O4)]
dipole: 1.2686979 2.4614147 -0.2212579 debye
polarizability: 327.5363528|-74.4993387|207.8867444|15.6545757|-28.4584879|114.3766386 unknown
InChI: InChI=1S/C8H18N8O4/c9-7(10)15-13-1-3(14-16-8(11)12)5(19)6(20)4(18)2-17/h1,4-6,17-20H,2,9-12H2
charge 0 multiplicity 1
38 atoms
O  -2.734809 -0.902477 0.207175
O  -2.242122 -2.464255 -1.908137
O  -0.857432 -0.707346 2.450321
O  -0.617471 -4.389285 -0.843432
N  -1.221969 1.279193 0.161652
N  2.249071 0.168209 0.40892
N  -1.014213 2.5381 -0.436397
N  3.50168 0.696124 0.077321
N  -2.111125 4.439243 -1.217784
N  -3.322433 2.947414 0.161731
N  5.77544 0.210933 0.10419
N  4.266019 -1.373597 1.037311
C  -1.447011 -1.646532 0.249576
C  -1.035354 -1.987676 -1.204829
C  -0.406777 -0.82808 1.048434
C  -0.0191 -3.138483 -1.311653
C  -0.130426 0.544115 0.427056
C  1.225172 0.976646 0.151036
C  -2.142429 3.267854 -0.480349
C  4.489885 -0.172299 0.415227
H  -1.656481 -2.581935 0.798497
H  -0.637653 -1.082366 -1.710132
H  0.543421 -1.376952 1.116347
H  0.86622 -2.949391 -0.680695
H  0.307715 -3.229044 -2.368517
H  -2.450866 0.078836 0.070227
H  -2.994847 -1.956373 -1.486818
H  -1.812435 -0.433527 2.415834
H  1.375219 1.975415 -0.280711
H  -1.527991 -4.39885 -1.248772
H  -2.748814 5.206413 -1.021233
H  -1.244913 4.631762 -1.716631
H  -4.210319 3.370854 -0.093488
H  -3.313907 2.106678 0.737371
H  6.594017 -0.328445 0.367591
H  5.882505 1.110827 -0.358403
H  4.991978 -2.045868 1.263397
H  3.279962 -1.565937 1.233065
