program: Gaussian 09
title: 000255023
version: EM64L-G09RevD.01
frameworkgroup: C1[X(C20H15N)]
method: RPBEPBE
basis: SDD
operation: Freq
keyword: #pfreq=noraman
keyword: PBEPBE/SDD
title: #p freq=noraman PBEPBE/SDD
converged: YES YES NO NO
title: Mulliken charges:
elementType: N C C C C C C C C C C C C C C C C C C C C H H H H H H H H H H H H H H H
charge: -0.680426 0.321516 0.017888 0.068850 0.171071 0.121570 -0.429861 -0.384310 -0.336540 -0.408325 -0.417036 0.293558 -0.254183 -0.269776 -0.242556 -0.243418 0.280642 -0.373103 -0.425160 -0.289499 -0.213077 0.227568 0.239070 0.269140 0.244782 0.247590 0.225551 0.227865 0.226658 0.226402 0.232856 0.215871 0.227695 0.224596 0.351431 0.305100
chargesum: 0.00000
title: Mulliken charges with hydrogens summed into heavy atoms:
elementType: N C C C C C C C C C C C C C C C C C C C C
charge: -0.023895 0.321516 0.017888 0.068850 0.171071 0.121570 -0.202293 -0.145240 -0.067401 -0.163543 -0.169446 0.293558 -0.028632 -0.041911 -0.015898 -0.017016 0.280642 -0.140247 -0.209289 -0.061804 0.011519
polarizability: 3.89186200e+02 1.63484170e+00 2.62921314e+02 -1.10506271e+01 1.05322394e+01 1.19165488e+02
1716.lowfreq: -8.4478 -4.6859 -3.8909 -0.0007 -0.0005 0.0004 39.5086 50.0751 67.0691
frequency: 39.4780 50.0736 67.0531 107.5063 133.0650 151.8436 164.8610 183.2407 227.2030 273.9293 279.6180 323.2527 381.7973 392.6398 396.8831 419.1539 427.9858 447.2362 459.3300 485.0698 510.3890 533.7220 535.7266 552.9364 570.2469 602.2122 616.0654 622.6076 660.9293 708.4415 733.4662 739.7967 746.8230 750.7102 759.5656 778.5999 786.2718 791.6080 844.2080 859.3904 866.4580 874.8912 883.9227 918.4108 941.5215 947.1996 949.2784 969.3747 981.5703 984.4245 993.0225 1008.7778 1023.4562 1033.4578 1047.5359 1075.6607 1111.8426 1138.1990 1141.4371 1169.1159 1173.4015 1175.2083 1204.8867 1229.0875 1254.2533 1265.3543 1298.1767 1305.1872 1323.2938 1355.3386 1385.0467 1395.1557 1401.0867 1437.0377 1439.9194 1448.1319 1466.1104 1475.5192 1493.6262 1566.3054 1579.7395 1587.0818 1608.9364 1611.8117 1613.1488 1628.2712 1641.4626 3067.1298 3115.0835 3118.9560 3121.4802 3123.4538 3127.4239 3136.2005 3140.9350 3141.3720 3154.7077 3160.4665 3165.7961 3173.3001 3549.5706 3691.6605
redmass: 4.7479 4.5700 4.3271 4.3736 3.9854 4.9103 4.6853 4.8827 4.4186 3.9871 4.5485 3.2825 1.6123 2.1680 2.4004 5.1772 3.2500 3.0057 1.2416 2.9944 5.1343 5.5493 3.6911 5.2170 3.3305 6.5000 6.8006 3.6058 5.9752 4.0094 4.2325 1.9832 2.4593 1.5123 1.7615 2.0420 4.3225 2.4906 1.4979 4.3828 1.7189 1.3800 1.6832 3.7647 1.5341 1.4322 1.4225 1.3208 1.3390 1.3360 6.7134 1.8396 2.2764 1.9197 1.9464 2.9574 1.7009 1.6882 1.5315 1.1094 1.0564 1.1263 1.9645 2.2078 2.2401 1.9319 1.6568 1.8373 1.8317 2.0156 5.0286 4.3221 3.2438 2.3561 2.8033 2.7107 2.7258 3.7718 2.9837 6.4583 6.2725 6.6473 7.2356 6.6107 4.9005 6.9909 1.2692 1.0864 1.0867 1.0859 1.0888 1.0856 1.0886 1.0909 1.0942 1.0933 1.0965 1.1001 1.1000 1.0966 1.0453 1.1038
irintensity: 0.5105 0.2752 0.5663 1.8300 0.1271 1.7894 1.5126 0.6905 3.0915 4.6622 2.2179 9.8291 42.0356 63.2546 65.5521 5.3752 6.3039 0.3714 81.0182 9.6726 0.5731 10.3818 4.5564 4.8561 0.3333 17.8661 4.8346 9.6012 0.5158 3.0231 1.0553 78.0711 7.6841 57.3855 15.0543 89.2097 1.5467 3.5174 4.2179 1.7125 22.9175 1.4014 4.1219 3.8257 4.4723 3.0538 0.2753 0.1008 0.0150 0.6210 4.2758 2.1900 2.4011 7.0197 8.4699 2.3808 1.8593 1.3523 15.3130 1.7154 8.5496 1.1916 5.8947 41.1824 4.0109 11.9389 3.0912 2.4393 13.6504 4.3796 17.6479 28.0930 0.3913 31.5174 49.0884 19.4230 4.9334 25.1392 44.5009 72.6393 1.8867 0.7563 18.4248 3.8773 15.8235 77.1306 138.1079 12.4702 13.0589 4.7051 1.5708 2.4396 1.5547 9.4334 25.9234 28.0311 39.3052 49.5136 39.0302 14.3512 35.2055 32.8913
temp: 298.150 k
press: 1.00000 atm
elementType: 7 6 6 6 6 6 6 6 6 6 6 6 6 6 6 6 6 6 6 6 6 1 1 1 1 1 1 1 1 1 1 1 1 1 1 1
symmnumber: 1
zpe: 750803.9 jmol-1
zpe.correction: 0.285966 hartree
zpe.thermalcorrener: 0.302148 hartree
zpe.thermalcorrenthalpy: 0.303092 hartree
zpe.thermalcorrgfe: 0.242458 hartree
zpe.sumelectzpe: -824.488907 hartree
zpe.sumelectthermal: -824.472725 hartree
zpe.sumelectthermalent: -824.471781 hartree
zpe.sumelectthermalfe: -824.532416 hartree
dipole: 0.6471 0.8150 1.3772
dipole: 1.7262
quadrupole: -107.7619 -109.6345 -123.6695
quadrupole: 2.7317 1.1110 5.5710
quadrupole: 5.9267 4.0541 -9.9809 2.7317 1.1110 5.5710
hfenergy: -824.7748732 hartree
pointgroup: C01[X(C20H15N1)]
dipole: 0.2890937 0.1435916 0.597516 debye
polarizability: 388.1395972|-6.5515209|247.9694034|-14.8378706|46.522654|135.1640016 unknown
InChI: InChI=1S/C20H15N/c21-20-12-6-1-7-14(20)13-19-17-10-4-2-8-15(17)16-9-3-5-11-18(16)19/h1-13H,21H2
charge 0 multiplicity 1
36 atoms
N  2.107118 0.015668 1.845617
C  -0.361036 -0.439379 -0.206062
C  -1.764191 -0.943941 -0.22374
C  -0.463195 1.011204 0.108526
C  -2.656157 0.128442 0.101732
C  -1.850271 1.347045 0.29627
C  0.72975 -1.23145 -0.516132
C  -2.272608 -2.236899 -0.46627
C  0.513872 2.033021 0.148158
C  -4.047164 -0.086971 0.176982
C  -2.244241 2.671611 0.567547
C  2.178223 -1.000645 -0.410656
C  -3.67064 -2.449553 -0.399724
C  0.110166 3.364698 0.412975
C  -4.551381 -1.384311 -0.07966
C  -1.253253 3.681119 0.633967
C  2.825211 -0.400198 0.732862
C  3.009884 -1.525266 -1.445818
C  4.249514 -0.281053 0.742075
C  4.408903 -1.401897 -1.42873
C  5.027599 -0.763491 -0.322076
H  0.479219 -2.220343 -0.931046
H  -1.605914 -3.074945 -0.699942
H  1.566611 1.811799 -0.044258
H  -4.73206 0.730813 0.427474
H  -3.300532 2.925583 0.710239
H  -4.077905 -3.448322 -0.592922
H  0.862686 4.160565 0.441188
H  -5.629902 -1.570824 -0.028555
H  -1.543422 4.717236 0.842022
H  2.520487 -2.016814 -2.295931
H  4.735109 0.18595 1.608352
H  5.01142 -1.793562 -2.254097
H  6.117714 -0.656329 -0.286723
H  1.090813 -0.009541 1.857582
H  2.589768 0.394281 2.655771
