program: Gaussian 09
title: 000255021
version: EM64L-G09RevD.01
frameworkgroup: C1[X(C14H12N4O3)]
method: RPBEPBE
basis: SDD
operation: Freq
keyword: #p
keyword: freq=noraman
keyword: PBEPBE/SDD
title: #p freq=noraman PBEPBE/SDD
converged: YES YES NO NO
title: Mulliken charges:
elementType: O O O N N N N C C C C C C C C C C C C C C H H H H H H H H H H H H
charge: -0.182400 -0.258473 -0.241281 -0.432856 0.027582 -0.108739 -0.112952 0.356703 0.214499 0.193441 -0.412859 -0.298290 -0.365791 0.217594 0.180453 -0.335082 -0.295049 -0.784225 -0.201523 -0.198348 -0.231651 0.324120 0.327659 0.261460 0.361850 0.256570 0.275390 0.247131 0.266426 0.246999 0.235409 0.232044 0.234191
chargesum: 0.00000
title: Mulliken charges with hydrogens summed into heavy atoms:
elementType: O O O N N N N C C C C C C C C C C C C C C
charge: -0.182400 -0.258473 -0.241281 -0.071006 0.027582 -0.108739 -0.112952 0.356703 0.214499 0.193441 -0.085200 0.025829 -0.104332 0.217594 0.180453 -0.078512 -0.019659 -0.023669 0.033886 0.033695 0.002540
polarizability: 4.86276578e+02 9.23361199e+00 2.15877025e+02 2.18211971e-02 1.58071697e-02 7.65549940e+01
1716.lowfreq: -43.5177 -7.9931 -0.0011 -0.0008 -0.0006 4.2961 5.4329 17.9458 30.1739
frequency: -43.5145 17.8582 30.1514 50.0807 50.9962 76.1178 92.3442 135.3641 138.1967 155.2767 160.4612 214.0713 219.2163 277.8070 289.5098 338.5151 356.3746 394.1494 405.3012 405.8931 429.3644 478.6735 505.1150 507.7233 542.2698 572.1089 592.3484 608.8928 613.3279 666.6909 681.3552 687.5972 698.2234 732.1152 765.4240 784.4958 814.6440 853.0978 856.6375 879.0515 906.2216 929.5333 945.8002 947.9454 960.8766 985.9828 987.6598 989.6416 1003.8124 1009.6786 1014.6503 1036.2895 1047.7497 1077.2502 1129.2075 1144.4357 1153.1742 1172.0286 1173.2451 1208.2473 1229.6741 1253.7807 1295.6147 1306.2018 1340.1763 1353.5686 1362.5422 1381.6243 1391.4981 1429.3560 1443.7931 1448.7228 1463.8176 1464.4767 1477.3606 1519.3069 1573.2023 1581.6782 1601.8734 1608.9900 1639.3194 2992.9544 3077.7295 3131.3676 3139.9944 3142.9464 3155.2584 3161.5657 3168.1808 3174.6073 3183.1893 3196.6463 3259.1564
redmass: 1.0484 4.2274 5.2362 12.4444 6.1108 4.2406 6.1048 7.4717 5.6601 5.1803 6.2286 6.5053 7.6667 5.6954 7.6405 7.7959 5.0995 5.6183 6.9290 2.9025 3.9366 9.4211 3.2277 5.4894 6.0831 3.6137 3.0500 6.5790 6.3098 7.6250 6.4338 2.5220 3.3961 4.8133 9.7885 1.7545 4.7726 1.2469 6.7618 1.4304 1.1041 5.7387 1.4253 6.1524 1.4548 6.0571 1.7499 1.3755 1.3293 1.3265 2.0825 1.6790 2.2525 1.5015 1.8512 1.8929 3.1137 1.1074 1.7608 2.1812 3.1626 2.4681 2.0756 1.4126 7.1843 7.1911 5.5077 1.2410 8.9807 4.7245 2.2516 1.2036 1.0459 2.2628 3.3754 2.8025 3.6321 6.1210 6.2641 6.4570 4.3251 1.0383 1.0979 1.0855 1.0988 1.0888 1.0931 1.0912 1.0960 1.1001 1.0907 1.0953 1.0799
irintensity: 0.9347 0.0038 0.5171 3.0645 0.8655 0.3982 6.7959 0.5801 6.2430 0.9291 1.0130 4.8229 1.2044 0.7094 0.1130 5.5796 2.2536 2.0408 2.5004 0.0409 0.5691 39.4495 0.6826 4.5897 0.6502 22.6337 7.6473 2.5451 13.2320 12.0354 7.7038 34.9857 21.0507 6.0354 7.1266 48.1742 0.5910 0.0203 4.1455 52.8129 73.2543 4.4300 3.6704 2.3005 24.6699 5.2658 60.4287 0.0099 0.7909 2.9711 10.7737 12.9913 20.1494 10.8129 49.1655 2.6339 251.3765 13.4947 88.6651 152.6390 144.4096 12.1211 58.1197 0.5903 508.5824 152.5225 47.7300 86.8216 6.7439 17.0181 6.0332 31.6815 19.9073 3.8351 64.4401 573.3184 220.2874 7.2034 2.4744 218.5777 74.2425 2.5094 9.5098 2.0787 10.7028 8.8404 19.2910 3.5229 14.5735 35.1883 8.1981 9.6975 119.1139
temp: 298.150 k
press: 1.00000 atm
elementType: 8 8 8 7 7 7 7 6 6 6 6 6 6 6 6 6 6 6 6 6 6 1 1 1 1 1 1 1 1 1 1 1 1
symmnumber: 1
zpe: 633126.3 jmol-1
zpe.correction: 0.241145 hartree
zpe.thermalcorrener: 0.258782 hartree
zpe.thermalcorrenthalpy: 0.259726 hartree
zpe.thermalcorrgfe: 0.192925 hartree
zpe.sumelectzpe: -983.790951 hartree
zpe.sumelectthermal: -983.773313 hartree
zpe.sumelectthermalent: -983.772369 hartree
zpe.sumelectthermalfe: -983.839171 hartree
dipole: 1.5887 -1.2283 0.0073
dipole: 2.0082
quadrupole: -86.6667 -133.4022 -123.6827
quadrupole: -3.7041 -0.0288 -0.0076
quadrupole: 27.9172 -18.8184 -9.0988 -3.7041 -0.0288 -0.0076
hfenergy: -984.0320957 hartree
pointgroup: C01 [X(C14H12N4O3)]
dipole: -0.6294939 -0.2434618 -0.4107203 debye
polarizability: 485.599961|-18.0598153|119.8501112|-2.3952128|64.207915|173.2585257 unknown
InChI: InChI=1S/C14H12N4O3/c1-10(19)15-13-8-7-12(9-14(13)18(20)21)17-16-11-5-3-2-4-6-11/h2-9,15H,1H3
charge 0 multiplicity 1
33 atoms
O  1.458777 1.637481 2.847934
O  3.585308 1.142964 2.232361
O  4.778593 -1.553432 -1.762377
N  4.027319 -0.295912 0.088243
N  2.287452 1.071541 2.045541
N  -1.633045 -0.501853 -0.566609
N  -2.373817 0.115109 0.31943
C  2.636555 -0.341021 -0.063534
C  1.76788 0.323071 0.884987
C  -0.225601 -0.400524 -0.327848
C  0.365848 0.291238 0.751092
C  2.009442 -1.0323 -1.144524
C  0.616006 -1.058314 -1.26878
C  5.02211 -0.87485 -0.725906
C  -3.783932 0.024199 0.096165
C  -4.587197 0.694006 1.057688
C  -4.396027 -0.669475 -0.987955
C  6.434367 -0.59545 -0.226669
C  -5.992503 0.674009 0.941176
C  -5.798127 -0.683751 -1.095776
C  -6.600677 -0.014315 -0.134949
H  2.650726 -1.537561 -1.867821
H  -0.264421 0.802659 1.483079
H  0.142531 -1.590216 -2.100248
H  4.324027 0.245687 0.922488
H  -4.085668 1.217314 1.878373
H  -3.758302 -1.178648 -1.71678
H  6.637582 0.490752 -0.196186
H  7.15239 -1.075722 -0.906181
H  6.581806 -0.993545 0.794067
H  -6.610677 1.190639 1.68287
H  -6.27606 -1.214714 -1.926559
H  -7.692267 -0.031364 -0.227888
