program: Gaussian 09
title: 000255020
version: EM64L-G09RevD.01
frameworkgroup: C1[X(C12H10N4O2)]
method: RPBEPBE
basis: SDD
operation: Freq
keyword: #p
keyword: freq=noraman
keyword: PBEPBE/SDD
title: #p freq=noraman PBEPBE/SDD
converged: NO YES NO NO
title: Mulliken charges:
elementType: O O N N N N C C C C C C C C C C C C H H H H H H H H H H
charge: -0.200970 -0.269686 0.022940 -0.111377 -0.649431 -0.117845 0.273430 0.350652 0.182600 -0.413829 -0.353635 -0.339790 0.179705 -0.298714 -0.338707 -0.199842 -0.202651 -0.235456 0.326213 0.231454 0.257300 0.272436 0.255596 0.369756 0.315710 0.229079 0.233186 0.231878
chargesum: 0.00000
title: Mulliken charges with hydrogens summed into heavy atoms:
elementType: O O N N N N C C C C C C C C C C C C
charge: -0.200970 -0.269686 0.022940 -0.111377 0.036035 -0.117845 0.273430 0.350652 0.182600 -0.087616 -0.122181 -0.082490 0.179705 -0.026278 -0.083111 0.029237 0.030535 -0.003579
polarizability: 4.19181026e+02 -1.66040273e+01 1.91155572e+02 -1.25366824e-01 -1.32729305e-01 6.23432571e+01
1716.lowfreq: -7.4537 -6.2246 -4.5983 -0.0005 -0.0002 0.0000 20.0602 42.8944 54.5618
frequency: 20.0241 42.8929 54.5588 75.1418 109.9274 155.7319 160.1124 199.4544 247.7571 273.4184 316.9485 375.9732 380.2831 389.4929 405.9801 422.6127 479.4662 504.4271 504.9080 509.6395 551.4710 570.7218 608.7071 637.8456 673.5219 686.3805 695.6661 722.2080 753.3489 758.4790 782.5355 802.9972 828.5749 852.1949 863.7025 942.6391 947.6647 961.0039 977.6091 985.8402 987.7640 1001.4738 1014.8273 1027.9668 1052.4290 1076.7461 1143.2485 1148.4295 1170.7696 1173.3196 1182.5000 1219.6236 1275.5292 1305.3964 1332.4951 1340.5313 1354.2163 1389.8146 1400.8548 1443.2214 1449.3708 1465.2189 1505.2086 1551.0197 1574.4882 1582.1889 1602.4985 1631.6722 3130.4257 3136.7550 3141.9653 3155.2522 3167.3902 3167.8293 3173.9634 3179.6847 3393.6142 3638.9103
redmass: 4.2475 6.6483 6.4731 8.0935 6.1872 5.1350 6.6153 7.5739 7.4867 5.7973 5.3014 4.5686 5.3585 7.8541 2.8999 3.1885 8.4339 6.3193 3.3411 1.2264 4.7050 3.3296 6.5518 6.8969 8.4602 3.2757 2.5365 2.6749 1.3643 9.6355 1.7579 5.2316 1.4837 1.2469 6.5704 1.4308 5.2083 1.4662 1.3385 6.1786 1.3738 1.3255 2.0815 1.7820 2.1056 1.4998 2.2818 1.5076 1.0680 1.6480 3.1261 2.4393 1.8680 1.4009 5.9760 3.3552 6.9442 7.8980 5.3309 2.5514 3.9620 2.2801 3.4290 6.1408 1.4342 6.1653 6.2508 6.0556 1.0852 1.0888 1.0888 1.0929 1.0956 1.0964 1.1004 1.0908 1.0550 1.0950
irintensity: 0.2643 2.1795 0.7278 0.9137 0.2687 0.4177 3.1954 0.0033 3.2721 0.0157 4.6187 4.8709 10.4378 0.0401 0.1986 8.8137 40.6130 1.2554 3.2155 99.8461 4.5187 56.3215 0.5812 2.4845 6.8545 16.1389 47.2526 6.1910 144.6266 4.4419 50.9407 2.0204 34.7323 0.0022 2.6781 3.8850 0.6315 23.9142 0.8281 1.0159 0.0050 0.7798 10.6485 0.7629 32.0800 13.0986 11.0259 196.3756 2.9481 108.6918 255.0442 24.6885 19.6356 0.0146 66.9513 87.2911 1.4307 0.1547 13.3787 6.9368 16.6969 2.5988 51.9395 93.7533 110.3061 1.6680 3.6290 513.4863 2.2199 11.4027 10.5176 21.1902 13.4543 11.0551 35.3597 8.2427 151.8821 78.8748
temp: 298.150 k
press: 1.00000 atm
elementType: 8 8 7 7 7 7 6 6 6 6 6 6 6 6 6 6 6 6 1 1 1 1 1 1 1 1 1 1
symmnumber: 1
zpe: 537843.9 jmol-1
zpe.correction: 0.204854 hartree
zpe.thermalcorrener: 0.219693 hartree
zpe.thermalcorrenthalpy: 0.220637 hartree
zpe.thermalcorrgfe: 0.161048 hartree
zpe.sumelectzpe: -831.364723 hartree
zpe.sumelectthermal: -831.349884 hartree
zpe.sumelectthermalent: -831.348940 hartree
zpe.sumelectthermalfe: -831.408529 hartree
dipole: -0.3079 -5.1500 -0.0232
dipole: 5.1592
quadrupole: -78.3169 -99.6832 -108.1504
quadrupole: -23.4764 -0.0959 -0.0749
quadrupole: 17.0666 -4.2997 -12.7669 -23.4764 -0.0959 -0.0749
hfenergy: -831.5695771 hartree
pointgroup: C01 [X(C12H10N4O2)]
dipole: -0.0415538 0.9087794 -1.8145235 debye
polarizability: 416.1429258|36.9967972|91.4672952|10.038956|-49.8149018|165.0696336 unknown
InChI: InChI=1S/C12H10N4O2/c13-11-7-6-10(8-12(11)16(17)18)15-14-9-4-2-1-3-5-9/h1-8H,13H2
charge 0 multiplicity 1
28 atoms
O  2.624855 -0.873994 2.828952
O  4.648813 -0.216591 2.023359
N  3.344571 -0.322178 1.912853
N  -0.820724 0.478467 -0.683361
N  4.816794 0.97127 -0.306938
N  -1.473728 -0.085266 0.303859
C  2.692175 0.201938 0.711341
C  3.454415 0.825866 -0.349694
C  0.59123 0.552098 -0.49363
C  1.290227 0.071531 0.63427
C  2.71246 1.301549 -1.482416
C  1.327799 1.168998 -1.552138
C  -2.890738 -0.162555 0.120054
C  -3.595588 0.312469 -1.023789
C  -3.601465 -0.768195 1.190636
C  -4.994168 0.176404 -1.081406
C  -5.003921 -0.899953 1.123855
C  -5.703543 -0.428417 -0.011378
H  0.743816 -0.404396 1.453065
H  3.261297 1.77779 -2.302473
H  0.769906 1.535246 -2.419985
H  -3.029081 0.775726 -1.837154
H  -3.031624 -1.123197 2.055525
H  5.307385 0.617409 0.524258
H  5.308841 1.416716 -1.078165
H  -5.541957 0.539598 -1.958113
H  -5.549354 -1.367013 1.950607
H  -6.793092 -0.529521 -0.065789
