program: Gaussian 09
title: 000255019
version: EM64L-G09RevD.01
frameworkgroup: C1[X(C17H17N3O2)]
method: RPBEPBE
basis: SDD
operation: Freq
keyword: #p
keyword: freq=noraman
keyword: PBEPBE/SDD
title: #p freq=noraman PBEPBE/SDD
converged: YES YES NO NO
title: Mulliken charges:
elementType: O O N N N C C C C C C C C C C C C C C C C C H H H H H H H H H H H H H H H H H
charge: -0.177627 -0.182317 -0.299379 -0.113139 -0.115761 0.248276 0.420689 -0.329953 -0.488180 0.160972 -0.365115 -0.813417 0.195207 0.193036 -0.773581 -0.774283 0.181474 -0.294694 -0.337133 -0.199131 -0.202381 -0.232477 0.265111 0.286389 0.257979 0.241753 0.244695 0.239042 0.251902 0.249980 0.265248 0.257268 0.265133 0.246381 0.275875 0.252154 0.231737 0.234387 0.233882
chargesum: 0.00000
title: Mulliken charges with hydrogens summed into heavy atoms:
elementType: O O N N N C C C C C C C C C C C C C C C C C
charge: -0.177627 -0.182317 -0.299379 -0.113139 -0.115761 0.248276 0.420689 -0.064842 -0.201791 0.160972 -0.107136 -0.087927 0.195207 0.193036 -0.006452 -0.005501 0.181474 -0.018820 -0.084979 0.032606 0.032006 0.001405
polarizability: 4.87582701e+02 5.34038712e+00 1.70072621e+02 -3.44046534e+00 -2.54193037e+01 1.47130119e+02
1716.lowfreq: -8.5085 -1.4793 -0.0007 -0.0004 -0.0002 4.4760 20.9617 27.1478 33.5629
frequency: 20.7889 27.1009 33.5279 45.7833 56.4222 67.0099 75.2293 80.8623 115.0192 118.2055 126.1758 132.5903 147.8890 194.5775 197.4584 236.7291 257.8834 285.3024 312.8136 356.5732 381.3464 390.3674 406.0837 426.2210 442.8763 466.2198 503.5281 520.5396 529.7958 537.3735 551.5562 567.3909 609.1263 614.8300 621.9662 631.9547 677.8594 691.5759 745.6587 751.4960 784.2820 847.6871 853.4970 862.1272 881.1688 923.9320 928.5592 945.6207 956.6852 973.2200 986.0739 989.1068 992.3399 1003.7521 1005.3105 1013.8010 1014.6658 1031.7457 1033.9502 1045.7143 1076.1151 1105.5346 1133.5271 1158.0321 1171.7381 1192.6370 1194.8785 1207.8746 1218.8915 1265.9111 1278.3896 1305.7840 1354.9504 1371.2623 1380.3695 1381.0032 1390.6307 1405.3156 1409.6387 1443.9495 1444.1813 1445.8639 1457.5605 1459.2790 1464.1088 1465.3175 1468.2396 1483.1140 1575.3059 1582.4464 1599.9637 1602.6511 1608.2469 1669.4564 2980.5647 2999.6896 3000.1122 3054.9402 3085.9546 3087.8510 3096.7627 3129.9621 3130.8203 3131.8322 3139.4179 3141.8785 3154.5241 3155.4428 3167.1651 3168.7355 3173.8248
redmass: 3.9616 5.7095 2.5748 5.7598 1.5678 3.3873 4.7817 3.0846 1.1917 3.6755 3.9345 1.0734 5.9504 3.6545 3.7132 6.4936 5.7953 5.1052 4.3353 3.5549 4.8546 4.8113 2.8908 4.9268 4.3758 3.9564 3.4182 3.5049 5.5309 3.0088 4.3477 6.4735 6.3893 3.1615 3.5535 4.2645 6.0158 1.8511 3.7879 6.1247 1.7736 1.4388 1.2474 6.0529 4.1239 2.6535 1.4195 1.4409 3.0916 1.3702 6.1851 1.3742 2.8850 1.3293 1.6387 1.7749 2.0768 1.7358 1.7556 1.5642 1.4969 1.6466 2.0766 1.3367 1.0614 2.2428 3.8016 5.2674 2.6978 1.9788 2.8720 1.4097 7.8844 7.3988 1.2265 1.2179 8.5689 1.4848 2.2783 1.2559 1.7507 1.0926 1.0573 1.0536 2.0078 1.1097 1.5689 1.7743 7.7663 6.2855 6.3179 6.2816 9.2743 9.5727 1.0392 1.0369 1.0369 1.0951 1.0970 1.0969 1.0992 1.1006 1.0854 1.1004 1.0895 1.0888 1.0930 1.0911 1.0960 1.0962 1.1001
irintensity: 0.1557 0.2888 0.9895 3.2216 1.1088 6.1442 2.5599 0.9995 0.0771 0.3302 0.2101 0.1999 0.2674 0.5081 0.8444 0.0764 2.6437 0.0197 1.4677 1.8430 9.1285 9.8088 0.0509 4.7985 4.6045 3.4824 20.9576 6.5933 6.3443 3.1401 15.1191 2.6847 1.1092 28.7628 8.5368 18.6175 0.4165 58.3183 0.5724 0.0380 50.4828 15.0589 0.0552 0.8033 0.1385 7.0052 3.8173 7.3398 6.9188 10.2798 2.4491 0.0439 33.3275 0.5620 4.6012 58.4963 11.2256 5.2541 17.0888 7.6980 11.0048 25.4825 15.8457 39.4142 0.2842 2.5339 124.5768 629.0699 7.3137 54.2539 79.0865 0.1269 0.2333 10.9219 30.6087 51.4114 1.3553 17.3662 2.1933 12.2172 11.1467 66.8378 9.9285 35.2676 1.2274 11.6778 41.3533 98.0975 2.1486 2.4426 19.0786 40.8361 51.6008 430.9672 18.7346 3.6530 5.5814 14.1603 10.8971 6.8075 13.8035 15.3981 1.8893 14.1574 9.1536 8.7357 19.2914 3.1987 16.4823 4.6923 34.7843
temp: 298.150 k
press: 1.00000 atm
elementType: 8 8 7 7 7 6 6 6 6 6 6 6 6 6 6 6 6 6 6 6 6 6 1 1 1 1 1 1 1 1 1 1 1 1 1 1 1 1 1
symmnumber: 1
zpe: 793127.7 jmol-1
zpe.correction: 0.302086 hartree
zpe.thermalcorrener: 0.323551 hartree
zpe.thermalcorrenthalpy: 0.324496 hartree
zpe.thermalcorrgfe: 0.248758 hartree
zpe.sumelectzpe: -971.115820 hartree
zpe.sumelectthermal: -971.094355 hartree
zpe.sumelectthermalent: -971.093411 hartree
zpe.sumelectthermalfe: -971.169148 hartree
dipole: 7.4697 -0.0420 0.0955
dipole: 7.4705
quadrupole: -159.8078 -121.4489 -121.4471
quadrupole: 1.4109 -1.6450 -5.7537
quadrupole: -25.5732 12.7857 12.7875 1.4109 -1.6450 -5.7537
hfenergy: -971.4179065 hartree
pointgroup: C01 [X(C17H17N3O2)]
dipole: -2.9387164 0.0156616 0.0454499 debye
polarizability: 487.6240513|0.6245741|142.5189771|5.2979931|22.760595|174.6424121 unknown
InChI: InChI=1S/C17H17N3O2/c1-12-11-16(19-18-15-7-5-4-6-8-15)9-10-17(12)20(13(2)21)14(3)22/h4-11H,1-3H3
charge 0 multiplicity 1
39 atoms
O  5.545123 -1.361367 -0.107408
O  5.653939 1.411616 -0.04224
N  3.689456 0.096838 0.076402
N  -1.983002 0.349567 0.613465
N  -2.715688 -0.057512 -0.39232
C  2.24103 0.140086 0.172158
C  1.439639 -0.308845 -0.924765
C  1.641961 0.634556 1.354084
C  0.03771 -0.247109 -0.794288
C  -0.569703 0.248555 0.393847
C  0.241059 0.692165 1.470179
C  2.081795 -0.83351 -2.194965
C  4.367241 -1.169822 0.268506
C  4.41579 1.31897 -0.199487
C  3.546917 -2.249351 0.968417
C  3.565838 2.495379 -0.671711
C  -4.129241 0.039335 -0.181217
C  -4.744953 0.523043 1.009305
C  -4.930395 -0.392927 -1.271397
C  -6.148258 0.568133 1.093379
C  -6.336901 -0.343676 -1.178428
C  -6.948675 0.136563 0.003414
H  2.285133 0.966449 2.176558
H  -0.614547 -0.575418 -1.609834
H  -0.247015 1.06905 2.374174
H  2.863179 -0.149462 -2.573059
H  2.579621 -1.808351 -2.029652
H  1.328797 -0.973892 -2.987645
H  3.159625 -1.892301 1.938675
H  2.675313 -2.563375 0.36673
H  4.202838 -3.117767 1.127802
H  2.997858 2.936141 0.167296
H  4.248739 3.26006 -1.070851
H  2.834139 2.20273 -1.443957
H  -4.108049 0.850423 1.836544
H  -4.426806 -0.75953 -2.171968
H  -6.628483 0.938741 2.005877
H  -6.953432 -0.677025 -2.019914
H  -8.041092 0.175538 0.078498
