program: Gaussian 09
title: 000255018
version: EM64L-G09RevD.01
frameworkgroup: C1[X(C15H12O2)]
method: RPBEPBE
basis: SDD
operation: Freq
keyword: #pfreq=noraman
keyword: PBEPBE/SDD
title: #p freq=noraman PBEPBE/SDD
converged: NO YES NO NO
title: Mulliken charges:
elementType: O O C C C C C C C C C C C C C C C H H H H H H H H H H H H
charge: -0.286722 -0.253280 -0.658429 0.123120 0.213204 0.329196 0.142290 0.104110 -0.408926 -0.431282 -0.384373 -0.368410 -0.215923 -0.236005 -0.238520 0.149992 -0.502597 0.262402 0.262352 0.243509 0.247485 0.237260 0.271645 0.229881 0.225857 0.226443 0.241492 0.232488 0.241742
chargesum: 0.00000
title: Mulliken charges with hydrogens summed into heavy atoms:
elementType: O O C C C C C C C C C C C C C C C
charge: -0.286722 -0.253280 -0.133675 0.123120 0.213204 0.329196 0.142290 0.104110 -0.165417 -0.183797 -0.147113 -0.096765 0.013958 -0.010148 -0.012077 0.149992 0.213125
polarizability: 2.61254350e+02 1.11765238e+01 1.86127209e+02 1.31935929e-02 -9.54400640e-04 7.24720962e+01
1716.lowfreq: -0.0006 -0.0005 0.0006 2.5614 6.3343 7.9678 42.4551 74.1025 103.4207
frequency: 42.4504 74.1013 103.4204 106.8687 109.2620 137.3731 205.5021 218.0104 250.7478 267.7899 279.6698 325.7315 373.4726 423.4249 470.9261 471.6669 478.5258 547.3405 556.5381 574.3776 626.5637 652.7174 691.8421 727.0215 728.5751 734.9522 772.8636 789.2192 812.4797 826.1276 841.6012 870.9619 925.3340 935.5341 944.5950 961.9960 987.4554 993.0589 1019.5045 1039.1930 1062.5566 1099.8284 1114.6825 1121.4497 1127.8307 1147.4988 1168.5084 1176.9184 1182.9325 1199.2777 1223.5735 1251.8978 1289.5121 1308.2864 1382.2576 1386.9106 1416.8923 1424.5935 1431.4680 1450.2652 1452.0612 1464.5551 1466.5839 1480.2265 1591.2485 1594.2465 1601.1848 1618.2253 1625.0409 3001.5554 3002.6943 3041.6993 3101.5013 3121.2262 3128.1131 3130.3899 3141.7863 3145.1129 3151.8408 3160.8446 3180.7646
redmass: 5.0940 3.2463 1.3006 4.5689 3.8266 3.3548 3.7987 4.4192 2.2348 6.6000 4.5212 4.3534 8.4014 2.8369 2.7291 5.5600 4.3036 5.8059 5.4889 3.8930 6.4214 6.5274 3.3005 5.9526 2.7485 1.8120 1.7195 4.7597 4.7185 1.8618 5.7254 1.3893 1.7544 1.5129 8.1802 1.7053 1.3337 1.3591 2.5553 4.5301 2.2138 2.2183 1.2635 1.1537 2.0569 1.4670 1.1614 1.1810 2.0449 2.3756 1.9798 2.6437 1.9047 2.1623 3.6001 3.8197 1.3147 1.2049 2.6861 2.7382 1.0497 1.0564 3.2722 3.2894 7.1018 7.2787 7.9564 8.6256 7.5000 1.0304 1.0622 1.0971 1.1043 1.0853 1.0893 1.0878 1.0947 1.1045 1.0942 1.1003 1.0955
irintensity: 1.7810 0.0208 0.5769 0.8449 0.0992 4.2103 6.7387 3.5164 6.1894 6.5044 0.0010 13.6749 1.4523 6.7369 2.7153 3.6050 1.0594 0.8012 1.7116 0.0000 11.8096 3.6711 0.1613 3.4067 68.5812 1.5385 73.4871 14.5765 3.6146 24.0737 6.1609 0.2041 1.0450 0.0371 6.8002 6.1616 0.2565 1.7205 2.9923 105.8752 20.1846 45.4853 0.0758 0.0490 127.0151 72.1662 1.0993 3.9224 22.5404 6.9026 17.5542 232.9884 5.1787 16.8847 26.2454 4.6413 9.8938 35.2820 12.4996 3.6903 14.1043 15.4691 11.6401 11.7388 5.6058 10.5889 93.6668 55.8013 16.4151 47.1420 0.6189 2.3123 27.6714 3.2075 5.2617 3.5235 27.8064 17.6355 23.7952 38.9876 6.4280
temp: 298.150 k
press: 1.00000 atm
elementType: 8 8 6 6 6 6 6 6 6 6 6 6 6 6 6 6 6 1 1 1 1 1 1 1 1 1 1 1 1
symmnumber: 1
zpe: 592551.3 jmol-1
zpe.correction: 0.225691 hartree
zpe.thermalcorrener: 0.239582 hartree
zpe.thermalcorrenthalpy: 0.240526 hartree
zpe.thermalcorrgfe: 0.184617 hartree
zpe.sumelectzpe: -728.093726 hartree
zpe.sumelectthermal: -728.079835 hartree
zpe.sumelectthermalent: -728.078891 hartree
zpe.sumelectthermalfe: -728.134800 hartree
dipole: 0.5682 1.0042 -0.0004
dipole: 1.1538
quadrupole: -77.8110 -90.3756 -102.5315
quadrupole: -0.5150 -0.0041 0.0029
quadrupole: 12.4284 -0.1363 -12.2921 -0.5150 -0.0041 0.0029
hfenergy: -728.3194168 hartree
pointgroup: C01 [X(C15H12O2)]
dipole: -0.2325586 -0.3898375 -0.0016221 debye
polarizability: 261.65896|9.4548511|185.646421|3.6158045|-0.712079|72.5482741 unknown
InChI: InChI=1S/C15H12O2/c1-17-15(16)13-8-4-7-12-11-6-3-2-5-10(11)9-14(12)13/h2-8H,9H2,1H3
charge 0 multiplicity 1
29 atoms
O  -4.055267 0.229376 -0.129208
O  -2.520282 1.979343 -0.112971
C  0.331448 1.364387 -0.052958
C  -0.346176 0.00129 -0.055315
C  0.64148 -1.031304 -0.027703
C  1.811841 1.01109 -0.020871
C  1.977425 -0.406806 -0.006348
C  -1.721598 -0.334673 -0.079413
C  0.264775 -2.391719 -0.024106
C  2.934383 1.857517 -0.00543
C  3.266792 -0.982874 0.023865
C  -2.093948 -1.710226 -0.075391
C  -1.111169 -2.721996 -0.04812
C  4.229275 1.280754 0.024809
C  4.39277 -0.127572 0.039369
C  -2.749475 0.741977 -0.108372
C  -5.130854 1.244497 -0.157993
H  0.014036 1.975611 0.813028
H  0.048903 1.96142 -0.940656
H  1.02151 -3.184035 -0.003055
H  2.817049 2.947261 -0.016339
H  3.400742 -2.07072 0.035247
H  -3.156508 -1.965651 -0.0940
H  -1.418681 -3.773291 -0.045586
H  5.112878 1.928863 0.037147
H  5.401358 -0.555369 0.062872
H  -5.08112 1.883234 0.740348
H  -6.064839 0.66527 -0.179873
H  -5.03665 1.880049 -1.054979
