program: Gaussian 09
title: 000255016
version: EM64L-G09RevD.01
frameworkgroup: C1[X(C13H13N3)]
method: RPBEPBE
basis: SDD
operation: Freq
keyword: #pfreq=noraman
keyword: PBEPBE/SDD
title: #p freq=noraman PBEPBE/SDD
converged: YES YES NO NO
title: Mulliken charges:
elementType: N N N C C C C C C C C C C C C C H H H H H H H H H H H H H
charge: -0.683271 -0.110957 -0.137516 0.373367 0.321404 -0.477837 0.143856 -0.390465 -0.347913 -0.841215 0.182369 -0.304766 -0.348722 -0.203247 -0.206156 -0.244176 0.276405 0.218041 0.247445 0.224729 0.225371 0.249183 0.329686 0.310819 0.271932 0.245811 0.223583 0.225971 0.226272
chargesum: 0.00000
title: Mulliken charges with hydrogens summed into heavy atoms:
elementType: N N N C C C C C C C C C C C C C
charge: -0.042766 -0.110957 -0.137516 0.373367 0.321404 -0.201432 0.143856 -0.172425 -0.100469 -0.141933 0.182369 -0.032834 -0.102911 0.020335 0.019815 -0.017905
polarizability: 4.19851268e+02 1.16543753e+01 1.62645061e+02 2.12201315e-02 -7.51779925e-02 6.76546575e+01
1716.lowfreq: -6.5069 -5.2663 -0.0007 0.0004 0.0007 7.0464 26.3254 47.8434 67.7949
frequency: 26.3227 47.8378 67.7947 105.3091 173.7794 180.7355 183.3418 216.6723 272.3625 280.8741 303.3773 378.0302 386.3058 407.6398 412.8472 427.0662 451.2963 483.3879 511.4975 533.5228 546.9199 593.5022 609.9320 639.5561 693.6063 738.9169 741.5391 780.0040 785.3604 821.3431 850.7927 865.2953 929.7587 936.2216 953.8541 956.6979 983.8128 984.8022 996.4898 997.3410 1014.5388 1024.0906 1046.3157 1073.2817 1122.1477 1143.0423 1160.2222 1168.1571 1192.6890 1236.2324 1283.4342 1302.6118 1326.8670 1344.6984 1383.3643 1389.5111 1400.8776 1435.1886 1443.2974 1464.6936 1474.2410 1484.7707 1507.0962 1574.7995 1582.1844 1601.7104 1620.5080 1642.4477 2952.0453 3019.8899 3091.7235 3123.1786 3124.5355 3134.2287 3149.3390 3150.2846 3161.2896 3162.7806 3169.7496 3562.1679 3701.6772
redmass: 3.6902 5.0339 4.6995 4.7112 1.1313 5.0814 3.2184 4.1461 5.1430 5.3794 2.7649 1.2065 2.6572 2.8932 3.4060 1.7352 1.9457 7.2534 3.1767 5.9850 4.2145 3.0421 6.5294 6.7697 1.8512 5.5865 3.4214 1.7983 4.5518 1.4850 1.2470 6.2755 1.3839 1.4516 2.9726 1.3689 1.3660 6.1601 1.7204 1.3189 2.0683 1.4647 1.5188 1.4894 1.7452 1.5951 1.3422 1.0608 2.1828 2.9849 1.5276 1.4224 3.3089 7.2425 3.4047 3.8385 1.8139 2.7293 2.4028 2.2204 1.0453 1.3655 3.4431 7.2559 6.3046 6.2701 3.8914 1.3277 1.0399 1.0976 1.0949 1.0849 1.0885 1.0886 1.0931 1.0912 1.0957 1.0963 1.0987 1.0450 1.1037
irintensity: 0.3731 3.9489 2.7446 0.0643 0.7587 0.5673 0.0526 1.2493 0.0285 0.0156 1.0923 105.5348 94.2010 1.2794 0.1616 79.4315 12.8121 37.6307 7.2836 1.4972 11.3000 9.4873 0.1250 0.0351 51.7458 1.7952 12.6114 41.4645 4.4140 55.0206 0.0025 0.5934 5.7919 14.9554 1.3410 1.4876 0.0004 0.0454 3.7660 1.0465 9.3517 17.8517 7.1231 12.9822 99.5471 11.5486 4.5521 0.1818 11.1044 57.5720 5.8121 0.7455 226.2888 205.0272 5.8453 0.1974 10.4873 7.0441 14.1073 10.6057 14.3552 5.9196 138.9553 4.4497 1.8203 2.9786 152.0407 417.0757 52.9787 26.7729 8.7243 4.8555 25.6137 12.3046 27.8417 5.1482 14.0066 25.8286 31.4317 181.8395 25.7460
temp: 298.150 k
press: 1.00000 atm
elementType: 7 7 7 6 6 6 6 6 6 6 6 6 6 6 6 6 1 1 1 1 1 1 1 1 1 1 1 1 1
symmnumber: 1
zpe: 605320.3 jmol-1
zpe.correction: 0.230554 hartree
zpe.thermalcorrener: 0.244738 hartree
zpe.thermalcorrenthalpy: 0.245683 hartree
zpe.thermalcorrgfe: 0.188786 hartree
zpe.sumelectzpe: -666.285213 hartree
zpe.sumelectthermal: -666.271029 hartree
zpe.sumelectthermalent: -666.270085 hartree
zpe.sumelectthermalfe: -666.326982 hartree
dipole: -4.6835 0.3211 0.0035
dipole: 4.6945
quadrupole: -52.7325 -82.7042 -101.0456
quadrupole: 0.3117 0.0117 -0.0079
quadrupole: 26.0949 -3.8767 -22.2182 0.3117 0.0117 -0.0079
hfenergy: -666.5157675 hartree
pointgroup: C01 [X(C13H13N3)]
dipole: 1.8440505 -0.0522833 0.089287 debye
polarizability: 419.5224859|7.4328586|92.5536602|-12.8468829|-41.8734959|138.0748395 unknown
InChI: InChI=1S/C13H13N3/c1-10-9-12(7-8-13(10)14)16-15-11-5-3-2-4-6-11/h2-9H,14H2,1H3
charge 0 multiplicity 1
29 atoms
N  5.33647 0.107795 -0.392109
N  -0.304805 0.285742 -0.687672
N  -1.004279 -0.282761 0.26905
C  3.178495 -0.486314 0.614752
C  3.945703 0.134261 -0.435866
C  1.779494 -0.443681 0.5440
C  1.103562 0.196524 -0.538365
C  3.274267 0.774535 -1.518858
C  1.874006 0.804077 -1.567064
C  3.8916 -1.167231 1.768737
C  -2.424379 -0.181116 0.100412
C  -3.075459 0.471408 -0.986409
C  -3.201465 -0.791712 1.120865
C  -4.481653 0.50428 -1.038678
C  -4.610493 -0.754586 1.060851
C  -5.256017 -0.106642 -0.018808
H  1.168616 -0.90626 1.326547
H  3.862696 1.245262 -2.31574
H  1.343816 1.291702 -2.391686
H  4.538876 -1.998802 1.422379
H  4.530934 -0.459254 2.334687
H  3.166118 -1.593125 2.480535
H  5.830612 -0.343037 0.371927
H  5.884808 0.541485 -1.129751
H  -2.459828 0.936333 -1.76252
H  -2.675357 -1.285588 1.944837
H  -4.98391 1.005986 -1.874106
H  -5.203737 -1.228031 1.851112
H  -6.350394 -0.076248 -0.06786
