program: Gaussian 09
title: 000255015
version: EM64L-G09RevD.01
frameworkgroup: C1[X(C9H6Cl5NO)]
method: RPBEPBE
basis: SDD
operation: Freq
keyword: #p
keyword: freq=noraman
keyword: PBEPBE/SDD
title: #p freq=noraman PBEPBE/SDD
converged: YES YES NO NO
title: Mulliken charges:
elementType: Cl Cl Cl Cl Cl O N C C C C C C C C C H H H H H H
charge: 0.026755 0.055331 0.061230 0.059546 0.067630 -0.211044 -0.490023 0.860655 -0.364910 -0.317279 -0.500125 0.248728 -0.089851 -0.087211 -0.124049 -0.662440 0.314288 0.210123 0.249288 0.254691 0.218040 0.220626
chargesum: 0.00000
title: Mulliken charges with hydrogens summed into heavy atoms:
elementType: Cl Cl Cl Cl Cl O N C C C C C C C C C
charge: 0.026755 0.055331 0.061230 0.059546 0.067630 -0.211044 -0.175735 0.860655 -0.364910 -0.317279 -0.040713 0.248728 -0.089851 -0.087211 -0.124049 0.030917
polarizability: 2.18360959e+02 1.18052422e+00 1.85416877e+02 1.11623887e+01 -3.01979774e+00 8.06404104e+01
1716.lowfreq: -5.4461 -0.0019 -0.0018 0.0015 3.1242 6.8679 29.0078 43.1552 56.5158
frequency: 28.7431 43.0749 56.5115 70.7045 77.0550 83.2516 121.6339 182.0126 191.4822 203.5317 204.2533 205.9995 217.1237 247.9705 291.4784 299.4327 309.1525 320.9009 331.4608 353.7328 368.4319 497.0328 523.8670 552.6084 590.7640 596.6561 623.1358 650.0343 699.8258 735.8527 766.1031 794.7406 820.2252 905.5967 929.8621 1018.0610 1060.4371 1078.1625 1092.7402 1161.1995 1245.3387 1256.6597 1310.2363 1339.1506 1342.0316 1394.1971 1396.6981 1442.2767 1445.3664 1473.1640 1486.2267 1530.0393 1553.9393 1648.7523 2979.8378 2998.6829 3031.1654 3094.3850 3108.4385 3523.0709
redmass: 3.5411 6.7098 11.8519 3.9079 8.5390 6.6886 10.7040 9.4216 3.5471 25.4867 2.0720 4.5200 29.8464 5.7289 4.8766 6.3374 10.3464 13.2944 18.3289 14.9717 10.9995 3.9996 1.3210 5.3097 11.3325 7.0864 10.9965 9.0075 5.1344 6.8447 9.6039 1.3985 12.0983 4.5493 8.1983 2.2775 2.1254 1.9864 4.5500 2.5404 2.5529 1.7295 6.7786 3.3740 2.6825 4.7815 1.2644 2.0977 1.1175 1.0436 1.0526 6.9079 10.6306 6.8632 1.0595 1.0363 1.1002 1.1008 1.1003 1.0766
irintensity: 0.0851 0.9535 4.0314 3.3103 0.0066 1.2580 1.0357 0.8980 0.0530 0.0753 0.8246 0.8164 0.0066 3.0124 12.2631 1.3907 2.1932 0.4576 1.7382 0.3146 1.3153 20.3352 95.5572 1.1676 0.6502 0.6941 23.5497 38.2552 38.4165 30.2881 1.9320 11.9071 1.5751 14.8104 1.9232 14.3122 24.8716 1.8033 6.3804 189.7863 20.0875 1.1898 144.6661 50.8217 16.5175 156.0495 15.6518 352.3861 36.4347 12.8873 17.5224 19.1445 5.5277 106.6642 23.6112 30.2454 13.8197 33.9755 18.7846 26.3418
temp: 298.150 k
press: 1.00000 atm
elementType: 17 17 17 17 17 8 7 6 6 6 6 6 6 6 6 6 1 1 1 1 1 1
symmnumber: 1
zpe: 346345.8 jmol-1
zpe.correction: 0.131916 hartree
zpe.thermalcorrener: 0.148944 hartree
zpe.thermalcorrenthalpy: 0.149888 hartree
zpe.thermalcorrgfe: 0.084662 hartree
zpe.sumelectzpe: -2775.650967 hartree
zpe.sumelectthermal: -2775.633940 hartree
zpe.sumelectthermalent: -2775.632996 hartree
zpe.sumelectthermalfe: -2775.698222 hartree
dipole: -2.2942 1.9393 -2.9019
dipole: 4.1767
quadrupole: -116.3149 -128.6512 -128.7823
quadrupole: -5.7984 7.9990 0.6611
quadrupole: 8.2679 -4.0684 -4.1995 -5.7984 7.9990 0.6611
hfenergy: -2775.7828833 hartree
pointgroup: C01 [X(C9H6Cl5N1O1)]
dipole: -0.8213998 0.9343147 -1.0736098 debye
dipolederiv: -0.1717013 0.2610494 -0.0057244 0.2074167 -0.5591547 -0.028305 -0.019502 -0.0140315 -0.0107283 -0.2110258 -0.2500793 -0.143037 -0.2448712 -0.3687903 -0.1681874 -0.1164256 -0.203061 -0.0786294 -0.1226935 0.2351612 0.0116349 0.2692363 -0.5478247 -0.0316707 0.0127035 -0.0293625 0.0161048 -0.2446747 -0.2933246 -0.0905832 -0.3229731 -0.4093592 -0.1279769 -0.1153972 -0.1224944 -0.0252441 -0.6596284 0.0808725 -0.1493303 0.0974461 -0.0146487 0.0174834 -0.1717506 0.0281413 -0.0168371 -0.6627817 0.0558652 -0.0824762 -0.2913403 -0.47197 0.2925395 0.3155321 0.2536378 -0.6494454 -1.6923286 -0.1542201 0.2181094 -0.2636725 -0.3358321 -0.0038233 0.3181357 0.0519547 -0.509067 0.8977177 -0.0133468 -0.0072504 -0.2991753 -0.1834701 0.0054595 0.186077 0.009399 0.1071706 -0.0336522 -0.3922846 0.0183808 -0.4797036 0.7049281 -0.0051136 0.0255943 -0.0022806 -0.0722894 0.2065312 0.3965429 0.2280296 0.6075288 0.4181544 0.3034709 0.0806294 0.2590376 0.0888566 -0.2969208 0.0558121 -0.0504929 -0.0479825 0.1341587 0.0011222 -0.1415548 0.0374144 -0.0156423 1.7662668 0.1030186 -0.140743 0.8244317 0.4799706 -0.5009364 -0.531513 -0.4299518 0.7999083 -0.0325094 -0.4111487 -0.1045345 -0.4717047 0.7686315 -0.0073059 -0.1322972 -0.0077723 -0.048165 0.16433 0.5047248 0.0850933 0.5920579 0.474104 0.2013597 0.1423198 0.192568 0.0392032 0.8359655 -0.143249 0.2201676 -0.1543041 -0.2419983 -0.0766755 0.2392879 -0.0857323 0.0085131 0.0344433 -0.0033947 0.0447531 0.0360966 0.0410742 0.0370747 -0.0317529 0.026392 0.0154888 0.142388 0.0182748 0.0027388 -0.0571314 0.1804865 0.0925117 -0.0780655 0.0425187 0.2794109 0.022144 -0.0516249 0.0498481 -0.000989 -0.0834316 0.1391346 0.049081 0.0977543 0.0038834 0.0178789 0.0061274 -0.0164952 0.003709 -0.0038484 -0.1082147 -0.0128597 -0.0786236 -0.0057594 0.1485069 0.0192895 -0.0022908 -0.0306782 -0.04076 0.0887233 0.0399931 0.0694417 0.0379497 -0.188362 0.0394862 -0.0570498 0.0480161 0.1041496 0.0034858 -0.0845049 0.0095776 0.0471171 0.0801063 -0.063552 -0.028748 -0.0214131 -0.0445693 -0.124156 0.0262697 -0.1045273 -0.011799 unknown
polarizability: 216.0827626|-1.6961761|183.9314182|20.7790545|12.6127035|84.4040657 unknown
InChI: InChI=1S/C9H6Cl5NO/c1-2-3(16)15-9-7(13)5(11)4(10)6(12)8(9)14/h15H,2H2,1H3
charge 0 multiplicity 1
22 atoms
Cl -0.112072 2.966567 0.00577
Cl -0.614923 -2.43531 -1.131468
Cl 2.420585 -2.925274 -0.217846
Cl 3.006035 2.530048 0.708678
Cl 4.250019 -0.437322 0.665733
O  -2.467784 -0.958129 0.936267
N  -1.589886 0.450127 -0.713622
C  -0.22204 0.225252 -0.418556
C  0.617241 1.312765 -0.057507
C  0.360986 -1.067857 -0.499122
C  -4.043821 0.23852 -0.530892
C  -2.658364 -0.154314 -0.011221
C  1.714909 -1.274276 -0.148854
C  1.97904 1.126791 0.255521
C  2.526484 -0.178394 0.229975
C  -5.08825 0.303082 0.602318
H  -1.812552 1.25462 -1.305319
H  -4.001309 1.197319 -1.083746
H  -4.342107 -0.534884 -1.267173
H  -5.077882 -0.636326 1.179502
H  -6.100667 0.455803 0.189527
H  -4.869341 1.129593 1.300935
