program: Gaussian 09
title: 000255014
version: EM64L-G09RevD.01
frameworkgroup: C1[X(C8H4Cl5NO)]
method: RPBEPBE
basis: SDD
operation: Freq
keyword: #p
keyword: freq=noraman
keyword: PBEPBE/SDD
title: #p freq=noraman PBEPBE/SDD
converged: YES YES NO NO
title: Mulliken charges:
elementType: Cl Cl Cl Cl Cl O N C C C C C C C C H H H H
charge: 0.027824 0.057696 0.061991 0.060137 0.068100 -0.211408 -0.480651 0.855657 -0.363335 -0.304468 -0.089510 -0.087012 -0.120794 0.232855 -0.765606 0.316535 0.260327 0.264064 0.217598
chargesum: 0.00000
title: Mulliken charges with hydrogens summed into heavy atoms:
elementType: Cl Cl Cl Cl Cl O N C C C C C C C C
charge: 0.027824 0.057696 0.061991 0.060137 0.068100 -0.211408 -0.164117 0.855657 -0.363335 -0.304468 -0.089510 -0.087012 -0.120794 0.232855 -0.023617
polarizability: 2.01664115e+02 -4.26132253e-01 1.77344203e+02 -6.54928784e+00 -3.37658615e+00 6.98696988e+01
1716.lowfreq: -5.2616 -1.0865 0.0002 0.0022 0.0026 5.6121 46.7937 51.4000 61.9904
frequency: 46.7884 51.3988 61.9862 74.2978 76.8744 81.9994 132.5612 190.4442 201.2050 204.2801 207.0752 217.6958 281.2439 298.3875 308.5401 320.6832 333.3422 350.8393 366.4587 480.6433 520.0407 562.3180 574.5154 591.5498 619.3230 639.7289 671.0117 743.7360 771.9512 819.9638 905.8725 951.4950 995.8016 1037.3942 1086.4012 1211.6291 1252.1627 1312.6666 1339.2417 1385.6933 1394.2502 1438.1925 1455.4960 1468.4109 1530.4952 1553.3219 1650.0168 2996.0517 3085.5868 3124.3405 3527.3787
redmass: 5.2099 2.6240 1.9925 4.3074 6.4000 14.3471 13.9422 13.7512 15.7470 29.3114 24.1066 33.0034 5.3761 6.5186 12.9910 13.1940 14.8551 11.9907 13.4922 4.3937 1.2941 6.1868 4.0262 11.8560 11.6992 8.4342 9.6338 9.4399 10.4533 12.4614 4.6395 6.7929 1.9531 1.6722 8.5836 3.3522 5.1466 9.7458 11.9028 1.2392 5.8113 1.4736 1.3775 1.0741 6.4995 10.5812 7.0811 1.0374 1.0986 1.0990 1.0768
irintensity: 0.5758 3.0689 0.9564 6.5277 0.0450 1.6301 3.6060 0.2066 0.6770 0.2699 0.1355 0.1017 1.2487 3.1749 1.8840 0.7371 1.0518 0.3462 0.2772 26.3324 96.5693 1.6999 2.6953 0.7342 28.3025 3.9534 59.9264 32.6773 10.2287 1.6556 5.4934 0.5927 32.7962 20.4601 5.6230 193.3738 4.6093 166.2327 41.2580 42.1149 170.6949 227.5566 116.0024 18.2142 20.3243 4.3273 135.1429 7.6585 12.8865 7.7982 27.3337
temp: 298.150 k
press: 1.00000 atm
elementType: 17 17 17 17 17 8 7 6 6 6 6 6 6 6 6 1 1 1 1
symmnumber: 1
zpe: 272167.1 jmol-1
zpe.correction: 0.103663 hartree
zpe.thermalcorrener: 0.119441 hartree
zpe.thermalcorrenthalpy: 0.120385 hartree
zpe.thermalcorrgfe: 0.058234 hartree
zpe.sumelectzpe: -2736.427618 hartree
zpe.sumelectthermal: -2736.411840 hartree
zpe.sumelectthermalent: -2736.410896 hartree
zpe.sumelectthermalfe: -2736.473047 hartree
dipole: 2.1841 2.1749 -2.9529
dipole: 4.2685
quadrupole: -109.3080 -121.1270 -123.9686
quadrupole: 7.6807 -8.7896 0.5318
quadrupole: 8.8265 -2.9924 -5.8341 7.6807 -8.7896 0.5318
hfenergy: -2736.531281 hartree
pointgroup: C01 [X(C8H4Cl5N1O1)]
dipole: -0.8677771 0.6138058 1.3001777 debye
dipolederiv: -0.2027327 0.2760235 0.0640249 0.2214949 -0.5172135 -0.0862905 0.0665702 -0.1000253 -0.0248138 -0.1927486 -0.2740002 0.0622766 -0.2605867 -0.4673528 0.0643099 0.0396774 0.0971637 0.000114 -0.1490588 0.2551146 0.0444658 0.2818559 -0.5032696 -0.0892421 0.0485456 -0.0906596 0.0025049 -0.2099105 -0.2973547 0.0032849 -0.3244115 -0.4772439 0.0046611 0.0171762 -0.0007412 0.0134785 -0.6734388 0.0101288 0.1285359 0.0213837 -0.0006159 -0.0051217 0.1483925 -0.0148409 -0.0085295 -0.6083134 0.0130956 0.1170421 -0.2028149 -0.3737935 -0.2381348 -0.3347871 -0.2078551 -0.8258807 -1.5663708 -0.1799442 -0.2856817 -0.2453835 -0.364126 0.0116661 -0.4149876 -0.047087 -0.5623759 0.8726116 0.0461968 0.0443424 -0.1719278 -0.1726455 -0.0783189 -0.189116 -0.0888203 0.0806477 0.0432283 -0.4246494 -0.1137261 -0.5055292 0.6208299 0.1502565 -0.1491516 0.1556134 -0.0410993 0.1697082 0.4360513 -0.1007027 0.6009019 0.5855653 -0.1600971 0.0813267 -0.1165293 -0.0297181 0.0042389 -0.473414 -0.0114762 -0.5284278 0.668501 0.1723294 0.0032942 0.1749393 0.0047141 0.0972373 0.4978221 0.0516407 0.5877726 0.5925626 -0.0383128 0.0199982 -0.0358005 -0.0244782 0.8681184 -0.0316242 -0.1991407 -0.0386564 -0.2688172 -0.0073437 -0.2160244 0.0009603 0.0048118 1.6884121 0.1308764 0.1425369 0.6731082 0.3433706 0.4455763 0.700988 0.3617257 1.1364497 -0.4475784 0.0124238 0.1063582 -0.1067491 0.0424836 0.0316389 0.1499273 0.0047817 -0.046509 0.1316109 0.0145216 -0.0105176 -0.0712604 0.221507 -0.1170133 0.0512089 -0.0570826 0.2428913 0.0658869 -0.0037235 0.023092 -0.0345498 -0.0264863 0.0681493 0.050648 0.0560341 0.082866 0.0372598 0.0241716 -0.0515419 0.0576081 0.1163878 0.006116 -0.1038775 0.0281089 -0.0052103 0.0718396 -0.0317161 -0.0148137 0.0461716 -0.0196434 -0.1348287 0.0301908 -0.119885 0.0001367 unknown
polarizability: 199.2909096|5.3337459|176.3673174|-16.5901474|12.63547|73.2197906 unknown
InChI: InChI=1S/C8H4Cl5NO/c1-2(15)14-8-6(12)4(10)3(9)5(11)7(8)13/h14H,1H3
charge 0 multiplicity 1
19 atoms
Cl -0.613062 2.872445 0.656484
Cl -0.839164 -2.66052 0.415614
Cl 2.26191 -2.766561 -0.402547
Cl 2.557064 2.770366 0.059826
Cl 3.975395 -0.054143 -0.541105
O  -2.684419 -0.811639 -1.329125
N  -1.964719 0.188651 0.661182
C  -0.574072 0.109049 0.397398
C  0.212889 1.290837 0.361688
C  0.081195 -1.13532 0.195951
C  1.460213 -1.185054 -0.111386
C  1.596805 1.251943 0.095699
C  2.220515 0.007751 -0.162645
C  -2.962536 -0.273991 -0.227628
C  -4.384259 -0.090218 0.286959
H  -2.258252 0.804486 1.423383
H  -4.721189 -1.031194 0.759236
H  -5.049018 0.113752 -0.566421
H  -4.481597 0.72146 1.029138
