program: Gaussian 09
title: 000255013
version: EM64L-G09RevD.01
frameworkgroup: C1[X(C20H24Cl2N2O)]
method: RPBEPBE
basis: SDD
operation: Freq
keyword: #p
keyword: freq=noraman
keyword: PBEPBE/SDD
title: #p freq=noraman PBEPBE/SDD
converged: YES YES NO NO
title: Mulliken charges:
elementType: Cl Cl O N N C C C C C C C C C C C C C C C C C C C C H H H H H H H H H H H H H H H H H H H H H H H H
charge: -0.061815 -0.054662 -0.273128 -0.206394 -0.482146 0.282724 -0.366866 -0.410393 0.347419 -0.485843 0.270079 -0.406997 -0.395594 -0.584916 -0.587559 -0.838893 0.117543 0.320067 0.276257 -0.339155 0.468501 -0.534118 -0.439385 -0.854819 -0.814829 0.265205 0.241323 0.254429 0.263543 0.273526 0.231566 0.212997 0.270080 0.285077 0.288482 0.263432 0.235770 0.240877 0.235410 0.337154 0.308218 0.230791 0.231494 0.226254 0.229794 0.246996 0.226232 0.229659 0.226616
chargesum: 0.00000
title: Mulliken charges with hydrogens summed into heavy atoms:
elementType: Cl Cl O N N C C C C C C C C C C C C C C C C C C C C
charge: -0.061815 -0.054662 -0.273128 -0.206394 -0.144993 0.282724 0.139662 0.107579 0.347419 -0.212317 0.270079 -0.175431 -0.182597 -0.029759 -0.035645 -0.126836 0.117543 0.320067 0.276257 -0.030937 0.468501 -0.303327 -0.207891 -0.151775 -0.132323
polarizability: 4.20940761e+02 1.60204226e+01 2.70824430e+02 8.14329021e+00 1.96431111e+01 1.59267201e+02
1716.lowfreq: -6.1144 -4.9697 0.0008 0.0014 0.0017 2.4911 9.7800 15.9827 26.3517
frequency: 9.4118 15.8134 26.1370 28.1728 32.3217 39.4993 54.1926 58.6232 74.5093 89.9899 102.6998 112.0926 137.2670 165.1495 179.5829 184.9886 188.6802 200.8605 207.5886 212.3973 235.0172 266.1708 279.2703 285.5528 297.1990 314.7322 353.1083 365.5559 375.2151 385.8830 420.9895 443.3219 450.6617 458.5596 490.0452 534.5747 546.1127 557.8304 572.3437 592.8023 626.6882 632.7775 677.4326 681.0408 708.6648 712.6202 730.9974 732.0567 736.6585 770.9076 775.6660 781.2931 811.3925 837.8860 846.1223 886.3646 889.3016 915.6666 929.4617 938.8026 971.5239 975.9639 984.5041 997.1552 999.4222 1016.2537 1024.4077 1036.7624 1041.5623 1044.3626 1048.4820 1050.2381 1088.3437 1115.7956 1124.8936 1144.2965 1167.5513 1170.7409 1204.0168 1224.5029 1231.2292 1233.8181 1252.8347 1260.4124 1272.6355 1282.7312 1289.6196 1296.2915 1306.0783 1341.6398 1354.2387 1362.1314 1370.5744 1379.2265 1394.8563 1396.3845 1397.7010 1412.7995 1415.6994 1452.9218 1456.1910 1457.1547 1467.0820 1470.8289 1472.9381 1475.9352 1479.8966 1481.9841 1495.7542 1498.2299 1501.9331 1515.7886 1559.8786 1593.1583 1603.5983 1615.2755 1627.8698 2951.4077 2967.0778 2973.4611 2992.5334 3019.4990 3024.2921 3047.7598 3049.8593 3053.5313 3060.1862 3076.3334 3079.9840 3083.3574 3085.7137 3086.0472 3111.4399 3113.2646 3131.1526 3137.1528 3140.4414 3144.9387 3163.7951 3193.2441 3546.7850
redmass: 4.7283 6.1779 1.5072 2.9828 4.0579 13.5866 4.9928 5.5424 4.9669 2.6311 3.6063 2.6492 3.2404 3.7524 1.8282 3.8432 3.9091 5.1651 5.3978 1.5729 4.1095 2.1809 1.4683 2.7659 4.1437 4.2148 3.0836 3.8063 4.4261 5.2480 4.5040 2.9978 3.0950 3.1420 4.8210 4.5350 4.8292 2.7411 4.0566 5.1664 5.2371 1.3170 6.5891 6.0084 4.5970 5.0840 2.5913 4.0492 3.5956 1.7338 1.8926 1.2209 1.6193 4.7913 1.3285 1.3004 5.2825 1.5551 3.3882 1.3623 2.3768 1.5060 1.3296 1.6037 1.5852 1.4839 2.8849 4.5253 1.5123 1.5342 1.5606 1.7063 3.0730 1.6266 1.8624 1.8801 1.5520 1.4746 1.7047 2.4820 1.7459 2.4403 1.2160 1.1769 1.4990 1.7857 1.9038 1.4209 1.4749 1.4098 1.2689 1.9039 4.7469 3.8479 1.2777 1.2996 1.2540 2.6926 3.2282 1.5348 1.1819 1.0915 1.1088 1.0478 1.1075 1.1095 1.0863 1.0467 1.6049 1.2547 2.0019 2.2975 5.9086 8.1585 3.7527 6.3028 6.4389 1.0400 1.0399 1.0375 1.0656 1.0978 1.0601 1.0936 1.0975 1.0576 1.0565 1.1003 1.1002 1.0984 1.0991 1.0946 1.0911 1.0866 1.0911 1.0966 1.1119 1.1118 1.0899 1.0942 1.0751
irintensity: 0.4689 0.2839 1.2640 0.0592 1.0840 1.0265 0.4654 0.8301 2.5264 1.0611 1.0143 3.1534 1.8734 0.6398 5.4067 1.1729 3.8743 1.4591 7.3113 2.5726 2.6486 2.2346 1.2234 1.8401 1.7467 3.9120 2.1422 1.0234 6.3823 13.2801 3.3296 5.7510 1.6822 4.7053 15.5280 14.0213 7.5313 19.7348 11.6637 3.8399 1.8607 33.5693 53.2497 53.3517 21.4518 6.1430 7.9726 14.8973 31.4148 12.3470 6.3329 13.7890 14.1367 10.8245 50.7835 0.5683 3.4653 13.8904 17.1481 3.1691 29.4965 12.9220 4.7946 19.4220 7.4532 2.0102 2.3215 1.7871 1.4195 9.6761 17.1559 4.8503 3.4737 37.8259 25.5624 19.3890 3.2817 20.8582 19.4823 11.7594 6.5860 83.7931 29.8724 18.4377 56.2526 5.8825 3.7335 44.4329 46.0875 28.2539 16.5692 3.8657 99.7110 1.2207 11.3991 16.0941 25.7925 45.1789 1.8986 238.1057 52.5179 7.4442 33.0763 13.6674 31.2590 22.6201 28.5420 14.2107 26.3550 2.5424 157.4142 410.9873 129.3602 60.2320 38.1239 21.7771 1.7047 33.3731 35.4827 53.3789 27.3147 22.4336 32.2051 17.3593 23.0040 18.5312 18.1597 14.5271 15.1663 17.7471 9.9206 20.0534 30.0505 15.6910 20.7148 24.5370 14.7124 16.6043 4.2322 7.4087 16.0062
temp: 298.150 k
press: 1.00000 atm
elementType: 17 17 8 7 7 6 6 6 6 6 6 6 6 6 6 6 6 6 6 6 6 6 6 6 6 1 1 1 1 1 1 1 1 1 1 1 1 1 1 1 1 1 1 1 1 1 1 1 1
symmnumber: 1
zpe: 1041397.6 jmol-1
zpe.correction: 0.396647 hartree
zpe.thermalcorrener: 0.423026 hartree
zpe.thermalcorrenthalpy: 0.423970 hartree
zpe.thermalcorrgfe: 0.334788 hartree
zpe.sumelectzpe: -1879.552276 hartree
zpe.sumelectthermal: -1879.525897 hartree
zpe.sumelectthermalent: -1879.524953 hartree
zpe.sumelectthermalfe: -1879.614135 hartree
dipole: 1.5644 -4.7578 -2.1507
dipole: 5.4506
quadrupole: -152.6172 -164.0406 -169.6503
quadrupole: -3.3788 5.7011 9.1924
quadrupole: 9.4855 -1.9379 -7.5476 -3.3788 5.7011 9.1924
hfenergy: -1879.9489232 hartree
pointgroup: C01 [X(C20H24Cl2N2O1)]
dipole: -0.5173893 2.0057943 0.5547537 debye
polarizability: 420.7679496|2.5322301|241.0380382|21.329955|52.1837224|189.2264042 unknown
InChI: InChI=1S/C20H24Cl2N2O/c1-14-4-7-18(16(3)12-14)23-20(25)17-6-5-15(2)19(13-17)24(10-8-21)11-9-22/h4-7,12-13,23H,8-11H2,1-3H3
charge 0 multiplicity 1
49 atoms
Cl 6.393838 -1.289484 2.582269
Cl 3.875628 -2.91417 -3.447275
O  -0.900307 -1.423028 -0.522995
N  3.961519 0.061164 -0.515806
N  -2.142637 0.504539 -0.000252
C  2.767355 0.637855 0.018894
C  5.15237 -0.17144 0.329658
C  3.924399 -0.642609 -1.815552
C  2.787308 1.851396 0.790426
C  1.514105 0.028808 -0.255335
C  0.295899 0.550004 0.229991
C  1.559416 2.33246 1.310264
C  0.324611 1.704393 1.053406
C  4.842937 -1.110841 1.51165
C  3.799889 -2.177852 -1.70647
C  4.042116 2.675881 1.010852
C  -0.956098 -0.216065 -0.124808
C  -3.483322 0.067263 -0.208627
C  -4.528155 1.027682 -0.015133
C  -3.803714 -1.260845 -0.588941
C  -6.20769 -0.707831 -0.587446
C  -5.863934 0.616109 -0.209126
C  -5.152318 -1.632331 -0.770955
C  -4.217465 2.459393 0.393356
C  -7.658802 -1.106691 -0.792731
H  5.567769 0.767705 0.729738
H  5.938445 -0.620628 -0.30264
H  4.852957 -0.410779 -2.372879
H  3.082895 -0.248647 -2.409735
H  1.448887 -0.896174 -0.835675
H  1.578676 3.244842 1.91858
H  -0.58249 2.105852 1.520728
H  4.576314 -2.130543 1.197079
H  4.069324 -0.700547 2.177439
H  2.841878 -2.51087 -1.281765
H  4.643423 -2.634317 -1.166499
H  4.678869 2.281762 1.827476
H  4.659634 2.713114 0.094937
H  3.773797 3.710658 1.283817
H  -2.038145 1.491305 0.240181
H  -2.995356 -1.978105 -0.739112
H  -6.664628 1.352319 -0.05953
H  -5.382524 -2.663712 -1.063659
H  -3.704781 2.513188 1.375695
H  -3.580369 2.980192 -0.350308
H  -5.145828 3.046656 0.484866
H  -7.752208 -2.185444 -1.005441
H  -8.112664 -0.558095 -1.64026
H  -8.270825 -0.885495 0.101951
