program: Gaussian 09
title: 000255007
version: EM64L-G09RevD.01
frameworkgroup: C1[X(C13H7Cl2NO2)]
method: RPBEPBE
basis: SDD
operation: Freq
keyword: #p
keyword: freq=noraman
keyword: PBEPBE/SDD
title: #p freq=noraman PBEPBE/SDD
converged: NO NO NO NO
title: Mulliken charges:
elementType: Cl Cl O O N C C C C C C C C C C C C C H H H H H H H
charge: -0.029255 -0.038685 -0.206593 -0.207037 0.017737 -0.676654 0.342888 0.414399 0.161278 0.248329 -0.577993 -0.341655 -0.339744 -0.386124 0.412566 -0.389781 -0.255372 -0.093336 0.270983 0.270986 0.302228 0.252628 0.272983 0.290294 0.284930
chargesum: 0.00000
title: Mulliken charges with hydrogens summed into heavy atoms:
elementType: Cl Cl O O N C C C C C C C C C C C C C
charge: -0.029255 -0.038685 -0.206593 -0.207037 0.017737 -0.134684 0.342888 0.414399 0.161278 0.248329 -0.275765 -0.089026 -0.339744 -0.113141 0.412566 -0.099487 0.029558 -0.093336
polarizability: 3.19409037e+02 3.17448441e+00 1.99679040e+02 -5.50350303e-03 -1.11616596e-02 6.58621479e+01
1716.lowfreq: -13.7087 -7.1843 -6.3813 -0.0019 0.0006 0.0022 42.5610 47.1990 88.9880
frequency: 42.5137 47.1701 88.9870 94.5321 126.3179 156.7326 183.8919 200.6689 208.4603 262.4586 286.5800 321.8540 326.4087 374.1771 398.1363 426.9607 474.9810 494.1234 524.3762 533.3746 571.7135 575.2635 617.5208 653.2721 672.4937 703.6556 719.2749 760.8825 761.5486 798.7481 830.6936 852.9902 859.6666 883.6609 899.6665 906.3061 969.1082 990.5969 1026.7422 1068.3260 1084.2554 1124.9049 1137.4550 1166.8628 1188.6375 1189.7214 1213.6684 1229.8581 1264.7984 1286.1740 1364.5477 1371.0508 1400.8837 1407.2843 1426.6804 1435.7789 1457.1309 1479.8090 1568.1579 1592.9099 1613.9122 1624.4700 2993.5436 3038.0224 3153.8459 3174.6391 3174.7982 3186.5287 3188.7285
redmass: 11.7037 12.9869 4.8011 14.5164 9.7228 22.5113 5.1146 10.6671 3.1823 12.6930 3.0475 5.1129 8.4106 13.1778 7.6806 2.8917 7.7680 3.9414 7.2334 4.9455 4.5436 4.1217 6.5090 8.4096 3.8863 3.7787 8.1733 8.2102 3.4800 7.2281 5.1699 1.4415 1.4704 1.5951 4.8254 1.6763 1.8325 1.3626 5.1812 1.9336 2.2342 1.6703 1.1433 2.0435 2.8742 1.8653 5.0692 2.2756 1.7897 1.8442 6.2765 6.0241 6.2117 3.2840 1.2154 4.4722 4.1233 4.4081 8.5495 7.9756 9.6104 7.7997 1.0615 1.0989 1.0905 1.0935 1.0930 1.0953 1.0936
irintensity: 1.4775 0.7014 0.0022 1.2385 1.3513 0.5425 0.6182 2.6243 1.0091 0.1550 8.7390 0.5387 0.0995 6.6230 5.5447 3.3993 1.2576 2.7441 2.6468 1.5829 0.3415 9.3517 9.9207 2.2923 12.8840 5.8061 58.6113 17.7806 4.2993 36.5165 35.7937 45.5609 19.7635 11.8292 2.3469 2.1173 22.4774 0.8569 19.2382 28.8197 46.2021 28.6892 0.1551 24.8873 0.6531 46.9229 351.6440 131.7284 49.0154 13.6629 46.3995 49.9100 33.2014 59.0282 1.9584 37.2081 27.0754 12.7380 93.1663 15.0353 46.4436 46.7112 1.8304 1.9749 5.3009 0.0435 2.0734 1.9779 3.2952
temp: 298.150 k
press: 1.00000 atm
elementType: 17 17 8 8 7 6 6 6 6 6 6 6 6 6 6 6 6 6 1 1 1 1 1 1 1
symmnumber: 1
zpe: 438036.0 jmol-1
zpe.correction: 0.166839 hartree
zpe.thermalcorrener: 0.181358 hartree
zpe.thermalcorrenthalpy: 0.182303 hartree
zpe.thermalcorrgfe: 0.123817 hartree
zpe.sumelectzpe: -1623.608224 hartree
zpe.sumelectthermal: -1623.593705 hartree
zpe.sumelectthermalent: -1623.592761 hartree
zpe.sumelectthermalfe: -1623.651247 hartree
dipole: -3.7661 -0.3268 0.0025
dipole: 3.7803
quadrupole: -156.2361 -111.1967 -117.7048
quadrupole: -2.6762 0.0139 0.0004
quadrupole: -27.8570 17.1825 10.6744 -2.6762 0.0139 0.0004
hfenergy: -1623.7750636 hartree
pointgroup: C01 [X(C13H7Cl2N1O2)]
dipole: -1.480037 -0.146602 0.0009845 debye
dipolederiv: -0.2327417 0.1729488 -0.0000152 0.3129907 -0.7179779 0.0000399 -0.0000263 0.0000412 -0.0531334 -0.5745113 -0.3492883 -0.0000074 -0.4539513 -0.4655116 -0.000001 -0.0000022 0.0000044 -0.0573538 -0.9822679 0.2050207 -0.0000964 0.3344528 -0.6057111 0.0003636 0.0005787 -0.0002908 -0.2279089 -0.8113149 -0.1805866 0.0000737 -0.3914362 -0.6992877 -0.0001321 0.0005916 0.0005716 -0.2292232 2.3512815 0.0364809 -0.0002391 0.1899623 1.068471 -0.0002979 -0.0007142 -0.0002551 0.1840684 0.0469983 -0.0291745 -0.0000015 -0.0134284 -0.1610069 0.0000226 0.0000653 0.0000304 0.1242009 -0.3498729 -0.2521886 0.0000304 -0.4851308 0.0954193 -0.0000064 -0.0000184 -0.0000485 -0.0268617 -0.2543528 0.2667273 -0.000012 0.3004177 -0.2464843 0.0000287 -0.0000169 0.000032 -0.0135685 0.682039 -0.1489515 0.0000228 0.0297897 -0.0120786 0.0000052 0.0000125 -0.0000048 0.0152865 -0.0186104 0.1409869 0.0000083 0.0052641 0.1238947 -0.0000087 -0.0000065 -0.0000009 0.0158861 0.3942275 0.1838485 -0.0000133 -0.156324 -0.0400672 0.0000377 -0.0002238 -0.0000446 -0.1207051 -0.3957092 0.1560555 0.0000084 0.1885437 0.0893696 -0.0000232 -0.000064 0.0000235 -0.1285508 0.4791761 -0.3603742 0.0000388 -0.5864794 1.1300259 -0.0000691 0.0000402 -0.0000789 -0.0607631 -0.2388966 -0.1937144 -0.0000021 -0.0779831 -0.1510733 -0.0000092 -0.0000011 -0.000009 -0.1194198 -1.1235405 -0.0706386 0.0001998 -0.0631061 0.0689554 0.0000628 0.0000403 -0.0000026 0.0602631 0.2213727 -0.0918866 0.0000254 0.2083147 -0.0569721 -0.000038 -0.0003295 0.0000005 -0.1113161 -0.3931376 -0.0591179 -0.0000058 -0.2077959 -0.4341327 0.0000101 -0.0000153 0.0000136 -0.0744904 0.7835801 0.5407925 0.0000196 0.8846505 0.6986432 -0.000006 -0.000003 -0.00001 -0.0497549 0.0090004 0.0053585 -0.0016089 -0.0063197 0.060675 -0.0706284 -0.0050779 -0.0895691 0.0232952 0.0090066 0.0053533 0.0016088 -0.0063295 0.0606915 0.0706227 0.005077 0.0895625 0.0232892 0.1205044 -0.028092 -0.0000081 -0.0101599 0.0494821 -0.0000049 0.0000077 0.0000355 0.1671639 0.0578202 -0.0815072 0.000013 -0.0568833 -0.0339353 0.0000095 0.0000797 -0.0000073 0.1503245 0.101456 0.0507001 -0.0000093 0.0284177 -0.0041364 0.0000097 -0.000005 0.0000131 0.1666904 0.0790363 0.0628875 -0.0000199 0.0217149 0.0769966 0.0000087 0.0000123 -0.0000104 0.1711116 0.0394568 0.0183599 -0.0000104 0.0108085 0.1057507 0.0000039 -0.000001 0.0000037 0.1714697 unknown
polarizability: 319.3139465|4.631796|199.774131|-0.0053671|-0.0112279|65.8621479 unknown
InChI: InChI=1S/C13H7Cl2NO2/c14-8-5-11-10-2-1-9(16(17)18)3-7(10)4-12(11)13(15)6-8/h1-3,5-6H,4H2
charge 0 multiplicity 1
25 atoms
Cl -3.456907 2.997132 -0.000255
Cl -4.859366 -2.375407 -0.000099
O  5.202465 -1.003416 -0.000538
O  4.891628 1.255607 -0.001092
N  4.446313 0.043147 0.000369
C  -0.371296 1.788602 0.0000
C  0.75867 0.769359 0.000129
C  -1.60738 0.909373 -0.00004
C  0.226695 -0.558837 0.000174
C  -1.243096 -0.47343 0.000057
C  2.142136 0.984373 0.000204
C  1.082566 -1.682705 0.000303
C  -2.965507 1.244823 -0.000146
C  -2.217615 -1.49488 0.000034
C  2.979282 -0.156824 0.000292
C  2.475602 -1.479409 0.000395
C  -3.971683 0.255959 -0.000175
C  -3.566762 -1.09651 -0.000092
H  -0.338791 2.452212 0.885651
H  -0.338669 2.452131 -0.885707
H  2.590646 1.981194 0.000155
H  0.678503 -2.699611 0.000334
H  -1.947301 -2.553511 0.000109
H  3.181456 -2.313786 0.000492
H  -5.029588 0.526912 -0.000256
