program: Gaussian 09
title: 000255006
version: EM64L-G09RevD.01
frameworkgroup: C1[X(C15H9Cl2NO3)]
method: RPBEPBE
basis: SDD
operation: Freq
keyword: #p
keyword: freq=noraman
keyword: PBEPBE/SDD
title: #p freq=noraman PBEPBE/SDD
converged: YES YES NO NO
title: Mulliken charges:
elementType: Cl Cl O O O N C C C C C C C C C C C C C C C H H H H H H H H H
charge: 0.061045 0.060922 -0.240880 -0.194973 -0.197493 -0.461491 0.338595 0.313010 0.137878 0.073244 -0.625458 0.524197 -0.353054 -0.360321 -0.357913 0.062640 -0.349518 -0.235549 -0.231342 0.369974 -0.744979 0.216151 0.271425 0.223643 0.318313 0.279742 0.236529 0.243080 0.308216 0.314366
chargesum: 0.00000
title: Mulliken charges with hydrogens summed into heavy atoms:
elementType: Cl Cl O O O N C C C C C C C C C C C C C C C
charge: 0.061045 0.060922 -0.240880 -0.194973 -0.197493 -0.153275 0.338595 0.313010 0.137878 0.073244 -0.409307 0.524197 -0.081629 -0.136677 -0.039601 0.062640 -0.069776 0.000980 0.011738 0.369974 -0.430613
polarizability: 3.60098691e+02 -1.92535385e+01 2.05470007e+02 -2.36497078e-02 -1.41561623e-03 1.03584024e+02
1716.lowfreq: -18.0819 -10.0415 -0.0030 -0.0027 -0.0023 2.9873 3.0533 24.5212 42.4772
frequency: -17.5972 24.4849 42.4769 69.1072 79.5688 97.2845 143.4355 151.4202 164.9853 184.5387 222.9694 253.1559 261.3807 287.1695 305.7682 350.0230 388.1343 407.9315 419.4859 437.4689 443.0940 482.0855 505.9535 579.8678 602.9240 604.4990 614.0467 625.9693 648.4605 664.1111 691.0052 696.3793 718.6417 726.2281 750.9421 771.3245 784.2266 785.2302 844.7599 856.4659 877.5292 885.9553 889.1491 947.4847 960.8751 978.7223 990.8375 1007.3106 1021.6991 1049.1874 1093.6699 1125.9735 1140.5755 1180.2941 1183.8321 1192.8130 1220.0413 1234.3795 1258.1737 1271.3261 1286.7217 1331.1864 1375.1762 1392.0159 1408.9638 1440.0096 1480.8748 1488.4668 1524.3187 1569.6663 1592.6131 1615.6303 1627.3275 1638.6626 1669.9358 3097.4489 3127.3181 3137.5776 3151.8594 3161.9916 3174.4318 3175.6013 3203.4893 3522.0950
redmass: 18.5694 12.9430 7.9905 8.5763 5.6905 4.9431 5.4213 15.1981 11.1466 8.0179 7.5743 12.2405 5.0294 10.5119 10.1230 8.0784 5.3746 6.7509 3.2901 3.4652 8.4704 9.5388 3.2246 8.7572 7.3153 2.8704 4.3936 6.9733 1.7314 3.8261 6.6847 7.8153 7.0590 2.8562 9.8217 3.7023 6.6407 1.5034 7.0235 1.4239 1.8692 6.3012 1.4460 6.2468 9.1567 1.3825 1.3214 1.3477 3.8250 1.9830 2.5974 2.0024 1.3777 1.1271 1.0639 2.3326 1.8467 3.2176 1.7824 1.4516 1.5604 2.4063 4.9534 7.2584 4.1820 2.6906 2.4120 3.0914 2.4418 5.6455 6.6520 6.3366 6.4707 6.6300 12.1160 1.0891 1.0906 1.0859 1.0893 1.0948 1.0912 1.1004 1.0960 1.0765
irintensity: 0.2030 0.0091 2.9978 1.1130 0.0775 4.4678 0.0223 1.8516 2.1401 0.3419 0.7074 0.9576 0.1500 2.1784 8.7900 4.7190 2.4959 0.5520 0.7857 2.9204 9.6641 10.3096 0.8291 15.4536 2.8989 104.1886 23.8409 8.7441 56.7899 14.0104 2.2495 36.7281 6.2057 5.3143 37.8790 17.2374 20.2157 60.5131 19.0272 37.7255 47.9385 1.3385 1.3306 0.4574 257.0186 1.8817 1.4324 0.2720 1.0207 1.6619 59.0104 55.4326 18.2080 7.6251 9.6045 99.3303 18.5767 25.6107 1.3380 21.3992 4.1800 49.2382 40.9300 127.4493 10.3644 28.2417 6.3274 207.5558 250.6463 7.9569 6.2366 39.4042 14.8127 225.0626 417.4963 11.2723 8.9665 2.6405 11.0899 11.1465 2.0018 19.3208 11.7999 13.4360
temp: 298.150 k
press: 1.00000 atm
elementType: 17 17 8 8 8 7 6 6 6 6 6 6 6 6 6 6 6 6 6 6 6 1 1 1 1 1 1 1 1 1
symmnumber: 1
zpe: 540653.5 jmol-1
zpe.correction: 0.205924 hartree
zpe.thermalcorrener: 0.222575 hartree
zpe.thermalcorrenthalpy: 0.223519 hartree
zpe.thermalcorrgfe: 0.159841 hartree
zpe.sumelectzpe: -1776.114539 hartree
zpe.sumelectthermal: -1776.097889 hartree
zpe.sumelectthermalent: -1776.096945 hartree
zpe.sumelectthermalfe: -1776.160623 hartree
dipole: -1.0521 7.6730 0.0026
dipole: 7.7448
quadrupole: -162.0094 -127.7355 -138.3804
quadrupole: -12.2663 -0.0009 0.0087
quadrupole: -19.3009 14.9729 4.3280 -12.2663 -0.0009 0.0087
hfenergy: -1776.3204635 hartree
pointgroup: C01 [X(C15H9Cl2N1O3)]
dipole: -0.5861546 2.9901373 0.0000946 debye
polarizability: 361.7933281|-10.2853134|203.7753594|-0.0155574|-0.0339347|103.5840344 unknown
InChI: InChI=1S/C15H9Cl2NO3/c16-13(17)14(19)18-8-5-6-12-11(7-8)9-3-1-2-4-10(9)15(20)21-12/h1-7,13,18H
charge 0 multiplicity 1
30 atoms
Cl 6.210577 0.94695 1.532799
Cl 6.210201 0.950943 -1.53221
O  -2.157944 -2.151585 0.000135
O  -4.445979 -2.209025 0.000278
O  4.370038 -1.228643 0.000414
N  2.801758 0.530218 -0.000398
C  -0.903098 -0.014442 0.000074
C  -2.174132 0.728028 0.000182
C  -0.947482 -1.436387 0.000037
C  -3.40109 -0.008927 0.000262
C  0.376843 0.594948 -0.000035
C  1.560844 -0.175548 -0.000204
C  0.226693 -2.215492 -0.00011
C  -2.248205 2.148413 0.000188
C  1.487176 -1.598946 -0.00024
C  -3.429751 -1.490202 0.000274
C  -4.651156 0.664112 0.000332
C  -3.489637 2.808256 0.000262
C  -4.700227 2.067589 0.000333
C  4.088012 -0.003019 -0.000742
C  5.165767 1.097784 0.000638
H  0.451244 1.688866 -0.000026
H  0.132638 -3.304798 -0.00014
H  -1.332478 2.747404 0.000126
H  2.404034 -2.18967 -0.000397
H  -5.562952 0.058633 0.000387
H  -3.520847 3.903151 0.000258
H  -5.663599 2.587042 0.000386
H  2.720958 1.550077 -0.000267
H  4.776596 2.125668 0.002003
