program: Gaussian 09
title: 000255005
version: EM64L-G09RevD.01
frameworkgroup: C1[X(C13H5Cl2NO3)]
method: RPBEPBE
basis: SDD
operation: Freq
keyword: #p
keyword: freq=noraman
keyword: PBEPBE/SDD
title: #p freq=noraman PBEPBE/SDD
converged: NO YES NO YES
title: Mulliken charges:
elementType: Cl Cl O O O N C C C C C C C C C C C C C H H H H H
charge: 0.035315 -0.014703 -0.118615 -0.201566 -0.192036 0.021155 0.272280 0.326385 0.247311 0.320138 -0.243211 -0.342905 -0.557579 -0.383760 -0.319330 0.415004 -0.377473 -0.098082 -0.244956 0.258568 0.333198 0.279328 0.295022 0.290514
chargesum: 0.00000
title: Mulliken charges with hydrogens summed into heavy atoms:
elementType: Cl Cl O O O N C C C C C C C C C C C C C
charge: 0.035315 -0.014703 -0.118615 -0.201566 -0.192036 0.021155 0.272280 0.326385 0.247311 0.320138 -0.243211 -0.084337 -0.224382 -0.104432 -0.319330 0.415004 -0.082451 -0.098082 0.045557
polarizability: 3.31021051e+02 -4.91171275e+00 2.15908452e+02 -1.59772179e-03 -9.53126888e-03 6.22490036e+01
1716.lowfreq: -3.5183 0.0015 0.0017 0.0023 4.4930 4.6907 45.2939 50.4138 69.0777
frequency: 45.2915 50.4102 69.0775 95.4119 125.6199 152.5005 161.6284 181.6880 190.9166 246.9990 259.9034 277.4458 308.1658 320.9494 381.5285 426.7758 427.2435 471.4899 493.1572 512.2285 541.0215 572.0427 578.0199 611.9861 651.1743 660.5223 686.9030 702.2277 760.1069 769.3333 799.6305 826.1302 832.7203 863.4870 866.5103 892.2551 936.2223 967.2601 995.9565 1043.0564 1053.4441 1076.5845 1115.3331 1140.9248 1167.2385 1194.1254 1209.2074 1240.2719 1272.2887 1358.5855 1367.4762 1386.7929 1399.3688 1439.9327 1442.3593 1476.6993 1568.6740 1587.0373 1602.6497 1612.9966 1639.2578 3153.9246 3173.2671 3180.9184 3184.8264 3186.0900
redmass: 11.6673 15.2545 11.1169 15.2105 9.7652 5.9165 23.4904 5.0687 13.4698 6.3816 12.7047 12.6917 10.9814 6.3173 13.6837 3.1904 7.8076 6.0835 9.2088 7.6810 5.7124 6.3016 4.2044 6.7956 4.8847 8.5432 9.5031 4.8549 11.6811 3.8604 8.0993 5.9894 8.3240 1.4187 1.4753 1.6097 6.1583 1.5326 1.3839 4.6437 2.0147 2.6661 2.6130 1.9328 2.9076 2.2984 8.2180 1.7906 1.7271 5.8033 5.9940 7.5262 3.4155 4.3582 3.4507 6.1359 9.7844 8.3161 8.4348 8.3323 11.3847 1.0909 1.0936 1.0934 1.0951 1.0936
irintensity: 1.0280 0.0074 2.6763 0.8416 0.4463 1.6464 0.3911 1.5683 2.5823 0.6134 0.4105 1.2634 0.8962 0.1412 8.5340 1.3573 8.3740 0.9333 0.2586 1.5784 0.5489 6.7363 8.1184 8.2311 21.7593 3.9052 22.0052 7.8308 42.6059 3.3354 45.7051 2.6135 21.7357 62.0887 6.9000 6.1897 61.2849 20.3893 0.6488 5.6544 36.3104 113.8828 39.2875 30.7780 11.1606 21.8140 471.8226 16.7419 16.7628 66.3569 25.5059 6.5151 85.6325 0.0612 5.1894 31.5133 85.1297 225.0477 12.7137 206.8287 97.6736 4.2744 0.0419 7.2528 3.2193 3.0093
temp: 298.150 k
press: 1.00000 atm
elementType: 17 17 8 8 8 7 6 6 6 6 6 6 6 6 6 6 6 6 6 1 1 1 1 1
symmnumber: 1
zpe: 388698.2 jmol-1
zpe.correction: 0.148047 hartree
zpe.thermalcorrener: 0.163188 hartree
zpe.thermalcorrenthalpy: 0.164132 hartree
zpe.thermalcorrgfe: 0.104220 hartree
zpe.sumelectzpe: -1697.563436 hartree
zpe.sumelectthermal: -1697.548296 hartree
zpe.sumelectthermalent: -1697.547351 hartree
zpe.sumelectthermalfe: -1697.607264 hartree
dipole: 4.3004 -4.2890 0.0033
dipole: 6.0736
quadrupole: -148.9065 -124.8464 -121.2792
quadrupole: 3.8592 -0.0140 0.0017
quadrupole: -17.2291 6.8310 10.3981 3.8592 -0.0140 0.0017
hfenergy: -1697.7114833 hartree
pointgroup: C01 [X(C13H5Cl2N1O3)]
dipole: -1.6602281 1.7185892 0.0013148 debye
dipolederiv: -0.22684 -0.2271495 -0.0000555 -0.4235963 -0.6216991 -0.0000876 -0.0000483 -0.0000321 -0.0119173 -0.5947113 0.3906633 -0.0001 0.4837695 -0.4937146 0.0000811 -0.0001897 0.000109 -0.0400574 -0.5085841 0.0679355 -0.0000382 0.1452911 -0.8984852 0.0004784 0.0001384 -0.0005328 -0.2708118 -0.9484008 -0.2053841 0.000044 -0.2755401 -0.59534 -0.0001574 0.0004555 0.0002559 -0.2237611 -0.7807658 0.1665498 0.0000996 0.2966285 -0.6624545 0.0001043 0.0003699 -0.0003259 -0.2181267 2.2165202 -0.017148 -0.0004058 -0.1506039 1.0437156 0.0000965 -0.0006528 0.0000374 0.1868907 0.6053118 0.1318051 0.0000572 0.051263 0.1027826 -0.000011 0.0003662 0.0000931 0.0104118 0.0521174 -0.1277115 -0.000034 -0.1817239 0.2516463 -0.0000283 -0.0004275 0.0000305 0.0205829 -0.7630703 -0.131575 0.0000083 0.0783489 -0.2432479 -0.0000919 0.000263 0.0000516 0.0338955 -1.0501677 0.1170949 -0.0001363 0.1509706 -0.5036274 -0.000058 -0.0002849 -0.0000028 0.0402046 1.4592884 -0.0109516 0.0001368 -0.1531083 1.104675 -0.0003941 -0.0001411 0.0002048 0.1280111 -0.5673792 -0.232245 0.0000446 -0.2265818 0.088387 0.0000415 -0.0000297 -0.0000034 -0.1247678 0.3787737 -0.0478541 -0.0000347 0.0844754 0.0007727 -0.000073 -0.0001778 0.0000411 -0.0700339 -0.5675696 0.2529593 -0.0001164 0.1522005 -0.1362917 0.0000454 -0.0000656 0.0000525 -0.1134242 0.6599195 0.1651495 0.000157 0.7476743 1.1557003 0.0001274 0.0002165 0.0000873 -0.0320026 -0.8922562 0.0566693 0.0002039 0.1333962 -0.0165167 -0.0000414 0.0001253 0. 0.0511832 0.3141327 0.1205369 -0.0000512 -0.2665242 -0.034972 0.0000602 -0.0002455 -0.0000127 -0.0859848 1.0473324 -0.5667163 0.0002651 -0.7554713 0.81806 -0.0000951 0.0003223 -0.0001089 -0.0340464 -0.2745908 0.1235753 0.0000026 0.1192587 -0.6251385 0.0000298 -0.0000633 0.0000414 -0.0753641 0.0578769 0.0795547 0.0000179 0.0505529 -0.0253942 -0.0000084 -0.0000254 0.0000109 0.1508264 0.1456162 0.0094196 0.0000027 0.0048717 0.0969931 0.000001 0.0000275 0.0000161 0.1718992 0.0963061 -0.0478909 -0.0000186 -0.0338392 0.0052983 -0.0000044 0.0000482 0.0000096 0.1659969 0.0974745 -0.057431 -0.0000055 -0.0201255 0.0888207 0.0000027 0.0000585 0.0000298 0.1693649 0.0436657 -0.009856 -0.0000435 -0.0115867 0.1000302 -0.0000179 -0.0000398 -0.0000522 0.1710308 unknown
polarizability: 330.7985923|-7.048636|216.1309109|0.0017747|0.0094999|62.2490036 unknown
InChI: InChI=1S/C13H5Cl2NO3/c14-6-3-9-8-2-1-7(16(18)19)5-10(8)13(17)12(9)11(15)4-6/h1-5H
charge 0 multiplicity 1
24 atoms
Cl -3.509124 -2.821753 -0.000434
Cl -4.829887 2.543575 -0.000584
O  -0.255768 -2.852373 -0.000425
O  5.228747 1.130874 -0.00095
O  4.913867 -1.129501 -0.001064
N  4.47316 0.083201 -0.000167
C  0.246674 0.717675 0.000585
C  -1.234168 0.626519 0.000484
C  0.779037 -0.605074 0.00049
C  -1.606735 -0.757642 0.000346
C  -0.355802 -1.599253 0.00103
C  1.106084 1.831982 0.000485
C  2.15605 -0.849902 0.000185
C  -2.194758 1.649285 0.000245
C  -2.966894 -1.099152 -0.000205
C  3.001679 0.286108 0.000085
C  2.50262 1.609675 0.000251
C  -3.553886 1.255328 -0.000213
C  -3.963457 -0.09242 -0.00048
H  0.718021 2.855198 0.000502
H  2.569848 -1.861703 0.00014
H  -1.922937 2.707743 0.000304
H  3.215022 2.438944 0.000153
H  -5.023391 -0.357034 -0.000862
