program: Gaussian 09
title: 000254976
version: EM64L-G09RevD.01
frameworkgroup: C1[X(C14H15NO2)]
method: RPBEPBE
basis: SDD
operation: Freq
keyword: #p
keyword: freq=noraman
keyword: PBEPBE/SDD
title: #p freq=noraman PBEPBE/SDD
converged: NO YES NO NO
title: Mulliken charges:
elementType: O O N C C C C C C C C C C C C C C H H H H H H H H H H H H H H H
charge: -0.451285 -0.270954 -0.485082 0.148544 0.190737 -0.505938 -0.508647 -0.413670 -0.401444 0.176135 0.025204 0.272651 -0.448577 0.147353 -0.390377 -0.768717 0.080239 0.220692 0.218354 0.221288 0.228233 0.208212 0.208236 0.213840 0.208822 0.300134 0.237924 0.269600 0.255679 0.255605 0.179707 0.377501
chargesum: 0.00000
title: Mulliken charges with hydrogens summed into heavy atoms:
elementType: O O N C C C C C C C C C C C C C C
charge: -0.073784 -0.270954 -0.184948 0.148544 0.190737 -0.066892 -0.059126 0.002778 0.021219 0.176135 0.025204 0.272651 -0.210654 0.147353 -0.120777 -0.077726 0.080239
polarizability: 2.73589578e+02 1.00388486e+01 1.69107023e+02 3.71156228e-01 1.19261909e+00 8.62171129e+01
1716.lowfreq: -2.9463 -0.0007 0.0003 0.0004 7.7742 12.2403 38.2279 54.5288 88.6247
frequency: 38.0666 54.4658 88.6176 118.3969 137.8087 140.8084 173.4331 233.8785 243.0749 274.9397 293.5082 322.2797 337.8191 349.7809 398.9150 448.2559 458.3617 499.0919 521.9620 530.2088 554.5361 555.8091 597.1751 613.0769 624.9222 642.3765 673.6897 724.5173 734.0683 780.5910 805.4379 821.0433 843.0425 854.9765 880.5720 907.3486 935.8133 966.8502 981.2612 1001.6713 1031.3814 1061.2517 1070.4304 1079.4141 1092.3998 1131.4518 1151.5942 1165.5370 1169.4231 1207.4473 1223.8864 1236.2302 1237.0188 1268.3627 1306.5035 1321.0399 1337.2472 1340.3001 1341.3335 1369.5508 1377.8604 1405.0230 1436.5896 1453.7795 1456.4455 1458.3389 1465.7367 1468.9830 1474.3111 1478.1643 1499.8399 1570.8127 1577.9811 1619.5544 1634.9616 2953.5339 2957.3039 2980.0118 2984.7811 2996.2175 3007.1685 3012.3763 3045.1280 3053.7515 3085.4276 3090.2872 3140.4358 3167.0420 3506.7837 3609.9011
redmass: 5.0997 5.7090 2.6784 3.1754 5.2172 1.1211 2.7325 4.2312 3.9909 3.1940 3.1139 2.4842 3.8441 3.8863 5.7954 3.7412 3.3619 1.3742 2.6118 4.0417 2.8542 2.6195 3.8989 3.5662 1.7720 3.7636 3.6000 4.6402 3.8593 5.5580 3.7349 1.5747 1.5893 2.6486 2.5716 1.4822 3.1300 2.1933 1.3240 3.3010 1.5256 2.1470 2.2752 1.9754 1.9428 1.1458 1.4400 2.3337 1.6230 1.7951 1.8951 1.4066 1.7133 1.4322 1.6153 1.7829 2.1645 1.4775 1.6022 2.5985 3.5516 1.2448 3.4680 1.0484 1.5532 1.3011 1.1231 1.1669 1.1084 2.1941 2.9489 7.4982 6.8581 7.2208 6.6283 1.0614 1.0635 1.0649 1.0661 1.0372 1.0926 1.0947 1.0989 1.1043 1.0986 1.0971 1.0884 1.0959 1.0636 1.0800
irintensity: 1.2923 0.0208 0.0311 0.0369 0.2445 0.3463 2.3176 0.3701 0.2723 2.7693 2.6526 2.4570 4.5034 1.1122 4.9793 2.7483 1.7879 80.2774 25.7056 14.1200 22.9238 13.7782 19.9907 12.5555 75.5035 0.9824 7.6018 48.7391 5.6342 0.8778 1.8736 9.2654 32.6232 1.4187 8.5645 0.5902 3.8932 8.0998 0.6197 248.4305 4.6908 98.5917 36.7712 0.5602 6.4005 3.8979 9.2782 2.7715 64.6635 50.4583 8.5820 1.4059 9.6724 3.7650 26.7226 19.1656 80.6192 8.3523 51.0741 51.9411 12.9590 24.1748 30.7139 9.7238 2.7521 2.0574 7.3490 9.8251 4.3298 38.7923 29.2718 95.4467 149.5535 369.0680 45.3128 48.4914 37.3188 32.9686 23.5184 29.2227 54.5969 26.2665 83.4810 61.1536 26.3699 8.7766 5.8650 8.1771 43.7975 43.8802
temp: 298.150 k
press: 1.00000 atm
elementType: 8 8 7 6 6 6 6 6 6 6 6 6 6 6 6 6 6 1 1 1 1 1 1 1 1 1 1 1 1 1 1 1
symmnumber: 1
zpe: 683503.1 jmol-1
zpe.correction: 0.260333 hartree
zpe.thermalcorrener: 0.275092 hartree
zpe.thermalcorrenthalpy: 0.276036 hartree
zpe.thermalcorrgfe: 0.218552 hartree
zpe.sumelectzpe: -746.503482 hartree
zpe.sumelectthermal: -746.488722 hartree
zpe.sumelectthermalent: -746.487778 hartree
zpe.sumelectthermalfe: -746.545262 hartree
dipole: 4.3144 3.6519 0.0630
dipole: 5.6528
quadrupole: -95.8116 -92.0120 -102.4543
quadrupole: -8.9986 -0.1931 0.2095
quadrupole: 0.9477 4.7473 -5.6950 -8.9986 -0.1931 0.2095
hfenergy: -746.7638146 hartree
pointgroup: C01 [X(C14H15N1O2)]
dipole: 1.6886919 1.4455942 0.068646 debye
polarizability: 273.200844|10.5646798|169.2290482|7.289175|0.4459945|86.4838221 unknown
InChI: InChI=1S/C14H15NO2/c1-8-9(14(16)17)6-7-11-10-4-2-3-5-12(10)15-13(8)11/h6-7,15-16H,2-5H2,1H3
charge 0 multiplicity 1
32 atoms
O  -4.439621 0.903963 -0.225898
O  -4.562822 -1.39925 -0.241358
N  0.917273 1.496438 -0.011062
C  1.898713 -0.565504 0.014835
C  2.139264 0.812194 0.029846
C  3.012513 -1.586312 0.047943
C  3.489487 1.4720 0.089901
C  4.34669 -0.917042 0.479035
C  4.583627 0.425113 -0.259744
C  0.467502 -0.74463 -0.042174
C  -0.13751 0.566837 -0.055823
C  -1.53142 0.804311 -0.108386
C  -0.381435 -1.883166 -0.080062
C  -2.35137 -0.369617 -0.146387
C  -1.763584 -1.68248 -0.130854
C  -2.050815 2.23242 -0.12095
C  -3.832525 -0.372623 -0.20441
H  2.765496 -2.413732 0.741782
H  3.137207 -2.049909 -0.953048
H  3.548236 2.332099 -0.607182
H  3.675246 1.87721 1.10692
H  4.325328 -0.727652 1.571092
H  5.190253 -1.606137 0.285543
H  4.578806 0.243438 -1.352562
H  5.578764 0.832157 -0.000148
H  0.815821 2.508499 -0.013537
H  0.034468 -2.896017 -0.071481
H  -2.453185 -2.531562 -0.16137
H  -2.651189 2.4327 -1.0240
H  -2.719599 2.423803 0.734701
H  -1.226914 2.967098 -0.084764
H  -5.423405 0.754352 -0.267395
