program: Gaussian 09
title: 000254973
version: EM64L-G09RevD.01
frameworkgroup: C1[X(C11H14ClN5O6S)]
method: RPBEPBE
basis: SDD
operation: Freq
keyword: #p
keyword: freq=noraman
keyword: PBEPBE/SDD
title: #p freq=noraman PBEPBE/SDD
converged: YES YES NO NO
title: Mulliken charges:
elementType: Cl S O O O O O O N N N N N C C C C C C C C C C C H H H H H H H H H H H H H H
charge: -0.016360 1.055784 -0.303429 -0.427015 -0.415569 -0.428399 -0.510102 -0.484360 -0.186465 -0.074176 -0.012501 0.036580 -0.603267 -0.147911 -0.140703 -0.083079 -0.176318 -0.334881 0.182456 -0.207293 -0.110014 -0.756828 0.185521 -0.320160 0.342524 0.285899 0.278787 0.290747 0.233507 0.233576 0.348969 0.286241 0.352059 0.351349 0.284867 0.290940 0.354180 0.344845
chargesum: 0.00000
title: Mulliken charges with hydrogens summed into heavy atoms:
elementType: Cl S O O O O O O N N N N N C C C C C C C C C C C
charge: -0.016360 1.055784 -0.303429 -0.427015 -0.066601 -0.076340 -0.510102 -0.484360 -0.186465 -0.074176 -0.012501 0.036580 0.095757 0.194613 0.145197 0.195708 0.114428 0.132201 0.182456 0.078948 -0.110014 0.170327 0.185521 -0.320160
polarizability: 2.58486732e+02 -5.03419340e+00 2.43132271e+02 7.92844432e+00 2.36927986e+01 1.42749886e+02
1716.lowfreq: -8.9064 -4.6606 -2.8108 -0.0013 -0.0013 -0.0012 11.0209 29.8343 40.3188
frequency: 10.7252 29.8023 40.2938 49.8256 62.9273 74.8117 87.2506 105.6739 113.8018 126.3096 133.4331 160.9034 173.0920 191.8163 212.0790 215.2939 232.0018 241.8586 253.7329 263.5690 279.6146 300.7409 304.0963 318.5898 336.0754 347.4960 351.1732 363.0765 378.7833 417.1045 435.6550 447.5087 507.6627 520.2794 554.1036 554.6448 555.8216 579.6726 598.5093 631.9113 641.9682 659.6377 663.0255 674.6530 732.6742 746.4723 786.6228 792.7340 830.6782 836.3055 837.1751 876.1622 929.0457 931.4670 938.5828 947.4318 966.7309 982.0789 988.5065 994.0778 1005.1184 1024.0769 1034.9737 1063.3202 1065.6100 1084.1187 1143.3995 1152.6625 1176.0184 1188.1236 1196.5139 1219.0860 1245.9597 1264.9677 1273.4207 1287.4326 1297.7189 1300.5400 1326.7921 1336.5522 1337.5674 1354.6877 1359.8480 1375.0395 1383.2427 1394.4487 1415.4422 1423.2921 1437.7968 1461.8806 1470.2153 1540.1694 1580.8665 1638.6608 2968.1679 2978.5248 2982.1947 3022.7166 3072.4082 3085.1346 3110.1038 3138.0932 3184.3279 3256.2144 3530.6092 3534.9386 3543.4044 3687.5574
redmass: 9.6225 8.6905 8.2976 5.9442 7.5662 5.6919 4.9287 6.1666 10.4211 5.6487 5.5387 6.6856 4.1417 7.2989 4.2757 4.8920 3.4621 4.0843 3.5391 1.4697 6.7320 1.1936 6.3987 4.8564 7.1352 7.8364 7.7053 18.2893 6.1429 5.3307 1.9237 2.2053 5.1906 8.5918 1.3406 1.1049 3.4358 8.4161 4.7243 4.5289 6.9609 8.6546 10.1323 7.0772 5.0730 6.5580 5.0884 5.9881 7.1084 8.2938 1.5092 6.7464 3.1559 4.3124 4.0251 2.8455 4.5667 3.2141 3.1539 2.8561 1.5299 4.1088 4.2792 1.9011 1.7788 2.7614 4.7718 1.4720 1.2439 1.8473 1.3241 2.5485 1.3255 1.6475 2.3338 1.7194 4.0788 1.3850 1.3287 1.1578 1.1525 7.0551 1.2887 1.4168 1.2734 7.0089 1.0800 4.6044 1.0592 5.1734 1.0920 8.0969 1.9253 2.6346 1.0679 1.0832 1.0333 1.0862 1.0899 1.0936 1.0881 1.1023 1.1079 1.0985 1.0656 1.0447 1.0661 1.1057
irintensity: 0.7192 1.4321 1.0333 1.7472 0.5096 10.9615 7.0793 1.6827 0.9407 2.6469 7.1667 0.0203 9.6586 5.3502 4.3427 1.7276 1.4020 9.0710 8.2650 1.0527 1.8090 121.6151 21.5563 10.0663 10.3707 31.6970 17.5494 1.8752 15.3067 3.0532 88.6463 63.6016 20.3372 15.8042 201.9083 15.3383 41.0610 44.1051 24.7706 39.4943 6.4556 26.4729 6.2709 10.0319 24.3083 12.5335 1.4402 18.8704 23.8515 82.7285 5.1121 29.7095 50.8022 53.1890 75.0307 22.6081 85.1311 75.6644 128.4351 50.4212 8.8999 36.6216 34.0049 29.4856 45.4910 18.7000 72.2072 6.1841 26.1464 32.5825 62.2106 112.7616 3.9843 17.6152 108.2704 74.8049 47.1564 33.3325 20.1788 27.9808 18.3696 81.0365 16.9310 2.2080 22.3358 83.7278 9.8556 34.1002 10.3825 48.9723 4.6257 131.4067 61.6023 694.7968 48.6552 5.1203 98.0240 7.4744 3.9205 32.3544 5.3224 48.1378 0.2034 1.7217 9.5304 172.4005 6.6765 57.7527
temp: 298.150 k
press: 1.00000 atm
elementType: 17 16 8 8 8 8 8 8 7 7 7 7 7 6 6 6 6 6 6 6 6 6 6 6 1 1 1 1 1 1 1 1 1 1 1 1 1 1
symmnumber: 1
zpe: 701440.6 jmol-1
zpe.correction: 0.267165 hartree
zpe.thermalcorrener: 0.291195 hartree
zpe.thermalcorrenthalpy: 0.292139 hartree
zpe.thermalcorrgfe: 0.211845 hartree
zpe.sumelectzpe: -2008.797970 hartree
zpe.sumelectthermal: -2008.773939 hartree
zpe.sumelectthermalent: -2008.772995 hartree
zpe.sumelectthermalfe: -2008.853289 hartree
dipole: -3.3004 -3.2333 1.3179
dipole: 4.8046
quadrupole: -156.7063 -153.7817 -168.1987
quadrupole: 7.2958 3.8017 13.8228
quadrupole: 2.8560 5.7805 -8.6365 7.2958 3.8017 13.8228
hfenergy: -2009.0651344 hartree
pointgroup: C01 [X(C11H14Cl1N5O6S1)]
dipole: -1.5794878 -0.9718815 0.3656966 debye
polarizability: 254.4044873|-10.4498517|240.3499642|15.5022535|31.8752174|149.6144373 unknown
InChI: InChI=1S/C11H14ClN5O6S/c1-24(20,21)23-7-6(19)4(2-18)22-10(7)17-3-14-5-8(13)15-11(12)16-9(5)17/h3-4,6-7,10,18-19H,2,13H2,1H3
charge 0 multiplicity 1
38 atoms
Cl -2.854572 3.188502 1.459078
S  1.967917 2.860445 -0.353882
O  1.620809 -2.160094 0.490316
O  2.47055 1.079875 0.242481
O  2.560476 -1.533395 -2.38712
O  3.820181 -2.621329 2.270423
O  1.043778 2.649358 -1.671615
O  3.330693 3.715032 -0.408508
N  -0.405588 -1.09292 -0.097555
N  -2.224681 -2.100177 -1.069416
N  -1.478511 1.013303 0.68081
N  -3.859182 1.08958 0.110352
N  -4.967913 -0.629401 -1.064569
C  1.855927 0.028051 -0.559165
C  2.943387 -0.95024 -1.099175
C  0.962744 -0.850902 0.384541
C  3.048113 -2.007125 0.01329
C  3.932172 -1.620543 1.208756
C  -1.472541 -0.208905 0.065288
C  -0.915316 -2.214165 -0.782439
C  -2.585205 -0.847202 -0.545419
C  0.897167 3.341085 1.136179
C  -3.823543 -0.138948 -0.511314
C  -2.718355 1.560643 0.647621
H  1.283921 0.466663 -1.402907
H  3.88539 -0.418424 -1.296326
H  0.888675 -0.354858 1.370194
H  3.328582 -3.002821 -0.367707
H  3.670329 -0.604705 1.572457
H  4.993485 -1.623048 0.908347
H  1.783903 -2.138627 -2.264304
H  -0.299135 -3.085005 -0.98648
H  2.853267 -2.772487 2.439124
H  0.084785 2.594813 1.152909
H  1.566169 3.282813 2.005353
H  0.540448 4.361965 0.938815
H  -4.957696 -1.536126 -1.528324
H  -5.823334 -0.079183 -1.011513
