program: Gaussian 09
title: 000018143
version: EM64L-G09RevD.01
frameworkgroup: C1[X(C4H6Cl2O2S)]
method: RPBEPBE
basis: SDD
operation: Freq
keyword: #p
keyword: freq=noraman
keyword: PBEPBE/SDD
title: #p freq=noraman PBEPBE/SDD
converged: NO NO NO NO
title: Mulliken charges:
elementType: Cl Cl S O O C C C C H H H H H H
charge: -0.002902 -0.002920 0.970970 -0.539637 -0.539635 -0.380979 -0.380966 -0.532519 -0.532525 0.348525 0.348527 0.305944 0.316084 0.305950 0.316083
chargesum: 0.00000
title: Mulliken charges with hydrogens summed into heavy atoms:
elementType: Cl Cl S O O C C C C
charge: -0.002902 -0.002920 0.970970 -0.539637 -0.539635 -0.032454 -0.032438 0.089509 0.089508
polarizability: 8.86989150e+01 -2.59989768e-02 1.07998240e+02 9.32157286e-03 -7.29677642e+00 7.26264532e+01
1716.lowfreq: -15.1848 -11.7275 -2.2725 0.0016 0.0025 0.0029 51.6537 89.1408 144.5664
frequency: 51.2927 89.0336 144.5648 164.4791 213.2397 255.6344 272.1332 272.2171 340.1607 345.5745 464.3074 510.3123 539.3417 595.6544 636.3044 759.2310 813.5677 846.1504 861.1073 882.4767 965.4140 997.7890 1053.3955 1109.4197 1113.5451 1146.2041 1173.3730 1201.9824 1216.3873 1255.3930 1306.8967 1391.8977 1399.7108 3069.6035 3070.2229 3104.3147 3110.7154 3176.4648 3176.9542
redmass: 10.4325 11.2194 15.8259 9.3512 6.6378 4.1854 5.9809 11.8334 4.2073 2.3530 9.6026 10.8553 5.5575 5.1978 3.3230 5.6679 11.4318 2.1577 1.8968 2.5597 4.1920 2.0356 1.3628 1.1911 1.1426 1.1616 1.8945 1.2942 1.2803 1.4009 1.5108 1.0989 1.1012 1.0565 1.0571 1.0873 1.0898 1.1106 1.1109
irintensity: 3.4416 1.3933 0.4581 8.9475 9.2811 2.9099 13.4311 6.7034 8.9470 0.6410 9.5132 47.9117 5.6356 48.6510 7.1074 6.2939 86.8107 3.5915 0.5276 2.3807 130.3069 8.6464 14.5352 0.0106 0.0814 7.3814 6.2879 3.7993 18.1301 1.2309 15.6024 32.4774 11.5201 1.5988 0.0012 0.3410 0.0033 0.0069 3.9741
temp: 298.150 k
press: 1.00000 atm
elementType: 17 17 16 8 8 6 6 6 6 1 1 1 1 1 1
symmnumber: 1
zpe: 257774.1 jmol-1
zpe.correction: 0.098181 hartree
zpe.thermalcorrener: 0.108131 hartree
zpe.thermalcorrenthalpy: 0.109075 hartree
zpe.thermalcorrgfe: 0.061752 hartree
zpe.sumelectzpe: -1623.776685 hartree
zpe.sumelectthermal: -1623.766735 hartree
zpe.sumelectthermalent: -1623.765791 hartree
zpe.sumelectthermalfe: -1623.813113 hartree
dipole: 5.2410 0.0064 0.0000
dipole: 5.2410
quadrupole: -88.7965 -85.7203 -65.8722
quadrupole: -0.0035 -0.0045 3.6919
quadrupole: -8.6668 -5.5906 14.2575 -0.0035 -0.0045 3.6919
hfenergy: -1623.8748656 hartree
pointgroup: C01 [X(C4H6Cl2O2S1)]
dipole: -2.0619546 -0.000487 -0.0000037 debye
dipolederiv: -0.1731389 -0.0752129 -0.0399178 -0.1014506 -0.5544811 -0.0807317 -0.0706048 -0.0754848 -0.1856318 -0.1732916 0.075472 0.0399656 0.1017179 -0.5543795 -0.0807071 0.0706564 -0.0754495 -0.1856383 1.5045277 0.0000966 0.000007 0.0000895 1.1854394 0.0051848 0.00004 -0.0724559 1.118297 -0.6264551 -0.040072 -0.0204785 -0.2122099 -0.587109 -0.03656 -0.0757232 -0.020598 -0.4981295 -0.6265768 0.0400473 0.0204981 0.2121762 -0.5869852 -0.0365511 0.075725 -0.0205606 -0.498122 0.1589684 0.0625941 0.1019987 0.2157608 0.6505288 0.1564456 0.3625359 0.1900386 0.0936003 0.1592268 -0.0629577 -0.1020939 -0.216058 0.650363 0.1563939 -0.3626626 0.1898113 0.0935955 -0.1726214 0.0018246 -0.0052802 -0.065344 -0.2067483 0.0149044 -0.0796727 -0.0078393 -0.1978261 -0.1726875 -0.0017894 0.0052634 0.0653444 -0.2067125 0.0149486 0.0796865 -0.0077762 -0.197814 -0.0267219 -0.0344091 0.0542642 -0.0272894 0.0078986 -0.0509358 -0.0137784 -0.0474852 0.0812832 -0.0267629 0.0343976 -0.0542258 0.0272595 0.0079404 -0.0509858 0.0137972 -0.0474759 0.0812755 0.0209941 -0.042236 0.0373507 -0.0365578 0.0443499 -0.0410583 0.02563 -0.0409186 0.0662642 0.066789 -0.0095099 0.028686 0.0304745 0.0527573 0.0353789 0.0163825 0.0385655 0.0812991 0.0209434 0.0422296 -0.0373253 0.0365533 0.0444093 -0.0410752 -0.0255989 -0.0409153 0.0662314 0.0668067 0.0095252 -0.0287122 -0.0304664 0.0527289 0.0353488 -0.016413 0.038544 0.0813155 unknown
polarizability: 88.6988825|-0.0068742|106.9186825|-0.0027512|9.5007673|73.7060433 unknown
InChI: InChI=1S/C4H6Cl2O2S/c5-3-1-9(7,8)2-4(3)6/h3-4H,1-2H2
charge 0 multiplicity 1
15 atoms
Cl -1.51875 -2.221968 -0.203125
Cl -1.520326 2.221191 0.203045
S  1.398766 0.000451 -0.000015
O  2.20168 1.33126 0.485466
O  2.202216 -1.329986 -0.485502
C  -1.276404 -0.507309 0.585728
C  -1.276717 0.506706 -0.585809
C  0.035733 -0.463952 1.350069
C  0.035501 0.464284 -1.350074
H  -2.153329 -0.368145 1.233855
H  -2.153505 0.366913 -1.233983
H  0.082284 0.36818 2.068585
H  0.35592 -1.422573 1.776544
H  0.082603 -0.367653 -2.06878
H  0.355128 1.423201 -1.776304
