program: Gaussian 09
title: 000254959
version: EM64L-G09RevD.01
frameworkgroup: C1[X(C14H16ClNO4)]
method: RPBEPBE
basis: SDD
operation: Freq
keyword: #p
keyword: freq=noraman
keyword: PBEPBE/SDD
title: #p freq=noraman PBEPBE/SDD
converged: YES YES NO NO
title: Mulliken charges:
elementType: Cl O O O O N C C C C C C C C C C C C C C H H H H H H H H H H H H H H H H
charge: -0.036748 -0.233534 -0.247195 -0.347890 -0.301263 -0.401064 0.627349 -0.049902 -0.163583 -0.372099 -0.346120 0.238406 0.225824 -0.204636 -0.229265 -0.242655 -0.262145 -0.263859 -0.669760 -0.669229 0.400573 0.274347 0.244521 0.257223 0.235214 0.239153 0.222365 0.233558 0.219840 0.232233 0.215560 0.251790 0.230119 0.213602 0.250518 0.228752
chargesum: 0.00000
title: Mulliken charges with hydrogens summed into heavy atoms:
elementType: Cl O O O O N C C C C C C C C C C C C C C
charge: -0.036748 -0.233534 -0.247195 -0.347890 -0.301263 -0.000491 0.627349 -0.049902 0.110764 -0.372099 -0.101599 0.238406 0.225824 0.052587 0.005949 -0.003502 0.193778 0.188214 0.027709 0.023643
polarizability: 3.31217885e+02 -2.08333111e+01 2.13473189e+02 -2.45038223e-01 5.28596349e+00 9.31444458e+01
1716.lowfreq: -5.3030 -2.7780 -0.0011 0.0005 0.0008 7.0198 11.9166 19.9378 40.9916
frequency: 11.7548 19.6766 40.9552 46.4898 61.6514 63.3712 89.1095 95.1838 104.7575 129.1020 152.1011 159.5375 193.5009 215.1318 221.5543 226.7048 263.6553 304.0688 321.3824 328.3098 348.0131 386.9208 402.0987 423.1317 439.6027 442.6473 452.3658 511.0262 541.5295 564.5258 638.2812 676.6936 684.2848 711.0737 714.1692 746.0994 752.6794 756.5395 802.3071 817.4532 821.6537 842.6975 849.8861 872.7264 936.1548 940.6662 978.8901 994.8978 1011.0530 1013.0777 1016.5176 1037.1576 1045.9072 1094.8777 1095.2760 1127.3764 1153.1418 1154.7345 1172.0460 1184.1950 1231.4407 1250.1008 1278.2563 1279.1757 1285.7478 1323.3341 1343.7698 1353.4707 1366.9432 1379.1506 1388.2806 1390.1591 1408.9867 1434.7905 1453.3603 1455.5904 1461.2495 1463.1628 1485.2036 1485.8502 1486.2955 1548.5296 1559.1658 1581.4283 1609.7616 1633.5049 2991.7217 2993.2845 3028.9344 3032.0905 3086.7553 3088.2076 3093.0596 3096.1926 3118.9574 3121.6678 3127.1030 3143.0637 3155.3007 3162.4723 3169.9968 3180.8129
redmass: 6.3120 4.4636 4.7260 3.7801 4.6501 4.1776 4.0962 4.2625 5.6764 2.8360 4.9970 4.2046 2.3397 2.9579 1.9229 1.9203 2.5848 4.1493 2.9651 4.8914 4.5108 10.0481 3.7627 3.4562 3.4738 10.5017 3.8627 5.3784 3.7680 6.7444 5.5246 5.8787 9.2322 3.5784 4.0970 6.1883 2.5488 1.3890 1.8268 1.9422 1.5688 3.9715 1.4450 3.2589 1.4313 1.4625 1.3244 2.7599 2.7718 1.2736 3.9599 3.4377 2.7480 2.1631 2.1470 1.7525 1.6841 1.6574 1.2564 2.2951 2.8579 2.1668 1.1232 1.1192 1.5661 2.2284 1.4270 1.5078 2.0670 2.9417 1.2399 1.2528 4.0955 2.4643 1.1244 1.1187 1.0446 1.0456 1.1085 2.7216 1.0748 3.8365 7.4633 5.4827 7.0033 3.8129 1.0362 1.0363 1.0593 1.0594 1.0970 1.0970 1.1033 1.1033 1.1057 1.1056 1.0848 1.0857 1.0896 1.0905 1.0925 1.1005
irintensity: 0.1272 0.8768 2.7200 0.7120 0.3183 0.3235 0.5124 1.0405 0.5252 0.4395 0.6152 0.7680 2.4874 4.6466 1.3585 3.3302 2.4058 2.9874 29.6358 3.0920 7.8943 11.5056 7.9721 5.9952 13.3942 2.1955 2.0100 5.5868 0.8228 21.7091 2.2355 16.8813 2.5796 1.1593 2.8224 38.6776 3.5284 74.6160 3.2643 2.8410 6.6613 4.3352 1.0327 10.4591 7.7161 11.3972 1.5150 4.3285 52.3306 83.7051 80.3259 111.0867 128.3322 30.1459 32.2783 29.7370 24.0011 25.1436 131.8415 467.2129 498.8004 281.2477 13.5340 9.5150 1.3363 34.7032 120.1692 22.1473 4.6914 130.1049 26.7280 26.3586 169.7349 23.0197 22.6907 32.5881 12.8284 16.3929 13.4918 19.8261 12.1303 44.3103 388.1213 17.3693 34.4773 983.2158 26.7629 24.0946 40.5849 35.8076 43.1741 39.6359 0.3130 0.2781 25.3224 45.5801 126.5972 1.0226 8.4085 34.1347 5.3572 10.0955
temp: 298.150 k
press: 1.00000 atm
elementType: 17 8 8 8 8 7 6 6 6 6 6 6 6 6 6 6 6 6 6 6 1 1 1 1 1 1 1 1 1 1 1 1 1 1 1 1
symmnumber: 1
zpe: 728099.3 jmol-1
zpe.correction: 0.277318 hartree
zpe.thermalcorrener: 0.297928 hartree
zpe.thermalcorrenthalpy: 0.298872 hartree
zpe.thermalcorrgfe: 0.224330 hartree
zpe.sumelectzpe: -1357.326418 hartree
zpe.sumelectthermal: -1357.305808 hartree
zpe.sumelectthermalent: -1357.304864 hartree
zpe.sumelectthermalfe: -1357.379407 hartree
dipole: 0.4115 -0.3390 0.0056
dipole: 0.5332
quadrupole: -95.9981 -118.7897 -126.5550
quadrupole: -11.3290 -0.4657 0.5036
quadrupole: 17.7829 -5.0087 -12.7741 -11.3290 -0.4657 0.5036
hfenergy: -1357.6037363 hartree
pointgroup: C01 [X(C14H16Cl1N1O4)]
dipole: 0.1784801 -0.1089792 0.0163367 debye
polarizability: 334.0932489|-6.1689582|207.5053706|-10.6826067|-17.7956055|96.2369004 unknown
InChI: InChI=1S/C14H16ClNO4/c1-3-19-13(17)10(14(18)20-4-2)9-16-12-8-6-5-7-11(12)15/h5-9,16H,3-4H2,1-2H3
charge 0 multiplicity 1
36 atoms
Cl 2.888186 2.69221 -0.626751
O  -2.973642 1.41375 0.084669
O  -3.501388 -1.194353 -0.013243
O  -0.762462 2.051192 -0.216672
O  -1.717106 -2.663187 0.260192
N  1.136123 0.256442 -0.156557
C  2.514788 -0.058215 -0.181367
C  -1.252983 -0.29857 -0.001715
C  0.11143 -0.629523 -0.039303
C  3.468129 0.976236 -0.390644
C  3.01353 -1.378285 0.00154
C  -1.632248 1.121654 -0.064435
C  -2.147241 -1.481401 0.105899
C  4.850274 0.726972 -0.424329
C  4.396693 -1.639181 -0.033246
C  5.323126 -0.592195 -0.2460
C  -3.348939 2.861608 0.008196
C  -4.429743 -2.360475 0.103306
C  -3.521156 3.303263 -1.448035
C  -4.74636 -2.659587 1.571799
H  0.823277 1.252777 -0.240311
H  0.343008 -1.696619 0.030121
H  2.320941 -2.206219 0.177776
H  5.544173 1.556123 -0.589229
H  4.751247 -2.664966 0.110323
H  6.398355 -0.793166 -0.271659
H  -4.29766 2.901237 0.56667
H  -2.574067 3.458282 0.520018
H  -5.3221 -2.028228 -0.451146
H  -3.970616 -3.233328 -0.39304
H  -3.899608 4.342081 -1.479078
H  -2.557642 3.270876 -1.982946
H  -4.245332 2.655099 -1.97086
H  -5.511807 -3.455674 1.634365
H  -3.844242 -3.005804 2.103116
H  -5.138738 -1.761028 2.078475
