program: Gaussian 09
title: 000254954
version: EM64L-G09RevD.01
frameworkgroup: C1[X(C8H15ClO2)]
method: RPBEPBE
basis: SDD
operation: Freq
keyword: #p
keyword: freq=noraman
keyword: PBEPBE/SDD
title: #p freq=noraman PBEPBE/SDD
converged: NO YES NO NO
title: Mulliken charges:
elementType: Cl O O C C C C C C C C H H H H H H H H H H H H H H H
charge: -0.095595 -0.248834 -0.302153 -0.427011 -0.402531 0.010662 -0.385913 -0.313423 -0.202424 -0.380204 -0.569949 0.215928 0.203528 0.213169 0.216037 0.210032 0.205261 0.202136 0.215924 0.214208 0.234476 0.195798 0.224400 0.216814 0.285123 0.264540
chargesum: 0.00000
title: Mulliken charges with hydrogens summed into heavy atoms:
elementType: Cl O O C C C C C C C C
charge: -0.095595 -0.248834 -0.302153 -0.007555 0.026675 0.220694 0.021484 0.116709 0.227851 0.061010 -0.020287
polarizability: 1.03684501e+02 -1.60982583e+00 1.03541733e+02 -1.85927966e+00 -4.66077068e+00 8.61917658e+01
1716.lowfreq: -26.7264 -10.8355 -0.0034 -0.0034 -0.0029 5.8942 25.8802 36.4714 78.1747
frequency: 25.3405 36.2948 78.1412 111.5195 144.1899 197.2954 205.9961 251.4230 285.2527 342.2765 372.6969 413.2642 468.1856 494.4744 541.3207 595.1343 665.6303 765.9272 770.5025 802.5584 845.6446 859.2227 872.4499 891.7727 926.1166 948.5926 1004.6599 1013.9775 1029.0281 1039.1943 1053.3053 1107.9368 1109.5157 1116.6105 1154.3842 1171.8303 1181.6588 1187.1901 1252.3685 1259.2955 1269.6458 1293.4325 1304.5256 1328.1102 1341.0397 1344.8814 1351.6760 1363.0915 1365.0120 1378.3725 1435.4179 1440.8110 1445.2997 1455.6314 1462.7848 1475.3971 1485.8946 2954.6527 2982.9550 2983.3728 2986.2416 2987.7363 2994.5117 3007.6502 3040.2462 3043.1581 3055.7065 3056.3385 3068.8068 3070.8306 3085.2696 3154.7600
redmass: 4.0762 7.7826 4.1893 3.3634 2.9619 3.0055 2.6999 2.9205 2.3880 2.1373 2.0454 3.7627 2.8834 2.5097 3.0731 4.0016 3.1623 2.6340 2.3313 1.5828 2.7848 1.9756 2.5121 2.6329 1.6314 2.6047 2.4889 2.1216 2.3000 1.6108 1.9710 2.4123 1.9954 1.8282 1.3706 1.3116 1.3206 1.2185 1.2274 1.1860 1.2069 1.2160 1.2432 1.2165 1.3838 1.4978 1.4045 1.4661 1.3231 1.4155 1.0869 1.1027 1.0909 1.0877 1.0855 1.0911 1.0781 1.0632 1.0603 1.0646 1.0787 1.0666 1.0609 1.0682 1.0976 1.0996 1.1012 1.0932 1.0620 1.1027 1.1016 1.1112
irintensity: 0.7538 1.3382 0.5083 1.4107 9.3063 1.7308 9.6345 8.0463 4.2875 7.0597 1.6374 5.6262 0.0622 1.4282 6.6956 19.9503 1.8345 33.5003 10.7823 10.9151 12.5504 6.0102 27.1284 9.2802 26.9486 167.6360 50.6596 11.0925 49.6429 9.8506 32.4186 31.7161 10.4431 13.8833 3.0946 5.4806 15.6344 9.2311 5.2961 3.7890 7.7215 22.5776 18.2828 6.9259 0.2981 5.9579 1.0044 1.6943 2.3692 0.5811 14.4919 11.5123 7.6558 12.1893 9.3979 8.7675 10.0276 52.2751 42.1516 18.6924 42.6848 19.9925 36.9442 61.1435 18.6303 29.2482 54.2877 21.3031 32.9623 44.2714 39.8179 11.7429
temp: 298.150 k
press: 1.00000 atm
elementType: 17 8 8 6 6 6 6 6 6 6 6 1 1 1 1 1 1 1 1 1 1 1 1 1 1 1
symmnumber: 1
zpe: 583810.2 jmol-1
zpe.correction: 0.222362 hartree
zpe.thermalcorrener: 0.234165 hartree
zpe.thermalcorrenthalpy: 0.235109 hartree
zpe.thermalcorrgfe: 0.182705 hartree
zpe.sumelectzpe: -923.439534 hartree
zpe.sumelectthermal: -923.427730 hartree
zpe.sumelectthermalent: -923.426786 hartree
zpe.sumelectthermalfe: -923.479191 hartree
dipole: -0.5680 -1.6880 1.5558
dipole: 2.3648
quadrupole: -72.1306 -71.6122 -75.7757
quadrupole: -6.8222 -0.1869 1.1072
quadrupole: 1.0423 1.5606 -2.6029 -6.8222 -0.1869 1.1072
hfenergy: -923.6618951 hartree
pointgroup: C01 [X(C8H15Cl1O2)]
dipole: 0.1220027 -0.6549777 -0.6494318 debye
dipolederiv: -0.2645258 0.0305337 -0.0017792 0.0426691 -0.5233266 -0.1085441 0.0034429 -0.1823013 -0.284381 -0.6645353 -0.0882375 0.0481281 -0.2662822 -0.8909836 -0.0807451 -0.109175 -0.1215127 -0.4866021 -1.401572 -0.1547671 0.0035219 0.0015988 -0.4675451 -0.0218655 -0.0096571 -0.0859619 -0.4616271 -0.020923 -0.0378877 0.0937524 -0.0303595 0.0110307 0.015843 0.0812564 -0.0292284 -0.0300138 0.1228975 -0.0131425 0.012573 0.0128625 0.0355031 -0.015203 -0.000859 -0.0208277 0.0701333 1.2514953 0.1506487 0.026893 0.1405423 0.7843715 0.1191089 0.3941643 0.3224353 0.5571272 0.0601281 -0.0251956 0.1001133 -0.025194 0.0228494 -0.0385156 0.0966946 0.0020637 -0.0123307 0.4034619 0.0650766 -0.0267811 0.1148473 0.5742941 -0.0332994 -0.0508582 -0.1482389 0.2700691 0.6975756 0.0592033 -0.1396861 0.0456768 0.3615467 -0.0196526 -0.3099038 -0.0761487 0.2764113 0.0014861 -0.0034613 -0.0237414 0.031851 -0.0856537 0.0273867 -0.0062731 -0.0356477 0.0297409 0.1781625 -0.0218635 0.0038157 -0.0781508 0.6344852 0.2504004 -0.0253251 0.2547533 0.2852127 0.0930882 -0.0497491 -0.0336957 -0.0378443 -0.0839648 -0.0951553 -0.0101164 -0.1289149 -0.0216101 -0.1421175 0.0681672 -0.0570365 0.0163435 0.0543233 0.0377725 -0.0732188 0.0687042 0.0204916 -0.0737082 0.0476047 -0.1394011 0.0478021 0.0182389 0.0138276 -0.1051151 0.0094596 0.0222263 -0.0777286 -0.0105202 0.164637 -0.0130607 0.049698 -0.0031191 0.1462294 -0.0013844 -0.0754568 -0.0371952 -0.0407425 0.0256873 0.0071905 -0.1642602 0.0928495 -0.0630923 0.1121853 -0.0483129 -0.1480318 0.004923 -0.074147 0.0741313 0.0750445 0.0041944 -0.0953813 -0.0170819 -0.0015156 0.075179 -0.0114657 0.0065237 -0.0402222 -0.1780866 0.0715291 0.0324055 0.1066832 0.0336437 0.0648633 -0.035546 -0.0117289 -0.0284745 -0.0484843 -0.0894013 -0.0037901 -0.1203192 -0.0842663 -0.0912641 0.0652347 -0.0403875 0.0062596 -0.0070677 0.0264789 -0.0661469 0.0912539 0.0036061 0.015995 -0.0127474 0.0004896 -0.0015998 -0.0055256 -0.117739 0.0741262 -0.0534719 -0.029419 -0.0404767 0.0415159 -0.0075368 -0.0311132 -0.1600837 0.1446234 0.0687616 0.1156126 -0.0127907 -0.1032819 -0.0257082 0.0825472 0.0123511 0.0898937 0.0239022 0.0963684 0.0647885 0.0073912 0.1128718 0.0193804 -0.0081024 -0.008345 -0.0854335 -0.1104816 -0.0718004 -0.0561276 -0.0213378 0.0448574 -0.0562662 0.1131335 -0.0327707 -0.0048803 -0.0507722 0.1057941 -0.0390594 0.0100091 -0.0567018 0.0350126 -0.1177921 0.0392909 -0.0059836 -0.043423 -0.0985309 -0.0317131 -0.0163986 unknown
polarizability: 104.0319544|1.7264259|102.5909672|-1.5480024|5.6672649|86.7950778 unknown
InChI: InChI=1S/C8H15ClO2/c9-5-3-7-11-8-4-1-2-6-10-8/h8H,1-7H2
charge 0 multiplicity 1
26 atoms
Cl -2.859739 1.883161 0.26527
O  1.186118 -0.034165 1.427966
O  -0.312038 -1.000972 -0.220091
C  2.053816 -1.092238 -0.660447
C  2.166323 0.302176 -1.320006
C  0.989722 -1.099542 0.448238
C  2.395496 1.383877 -0.237851
C  1.277563 1.318578 0.816905
C  -1.456796 -1.093312 0.706897
C  -2.727841 -0.924111 -0.131253
C  -2.780302 0.387819 -0.91195
H  1.796316 -1.868194 -1.40341
H  3.0217 -1.367579 -0.199735
H  1.230445 0.521781 -1.868534
H  2.990694 0.307448 -2.056725
H  1.025306 -2.019913 1.065801
H  3.374289 1.220368 0.254392
H  2.41214 2.39511 -0.688607
H  1.471178 1.985385 1.672871
H  0.298191 1.581567 0.369312
H  -1.377469 -0.306025 1.479734
H  -1.451989 -2.085511 1.206852
H  -3.613917 -1.016848 0.523943
H  -2.777856 -1.745066 -0.876356
H  -1.869367 0.54415 -1.506003
H  -3.68548 0.476957 -1.530115
