program: Gaussian 09
title: 000254953
version: EM64L-G09RevD.01
frameworkgroup: C1[X(C8H11N3O)]
method: RPBEPBE
basis: SDD
operation: Freq
keyword: #p
keyword: freq=noraman
keyword: PBEPBE/SDD
title: #p freq=noraman PBEPBE/SDD
converged: YES YES NO NO
title: Mulliken charges:
elementType: O N N N C C C C C C C C H H H H H H H H H H H
charge: -0.431799 -0.322115 0.018190 -0.017686 -0.357897 -0.296698 0.462884 -0.388060 -0.337619 -0.314981 -0.328240 -0.332335 0.197920 0.255516 0.244796 0.181947 0.276466 0.201611 0.219941 0.260104 0.235614 0.236591 0.335846
chargesum: 0.00000
title: Mulliken charges with hydrogens summed into heavy atoms:
elementType: O N N N C C C C C C C C
charge: -0.095953 -0.045648 0.018190 -0.017686 0.095540 0.130046 0.462884 -0.186449 -0.117678 -0.054877 -0.092625 -0.095744
polarizability: 2.14872085e+02 1.17688104e+01 1.08030978e+02 1.44864494e+01 -9.64769031e+00 6.02714335e+01
1716.lowfreq: -6.2939 -4.5687 -0.0005 -0.0004 -0.0002 5.6280 32.6933 37.0687 77.6355
frequency: 32.5952 37.0630 77.6183 106.9024 118.4498 194.0677 260.9405 278.6715 289.9563 311.2224 321.8671 371.7598 440.3687 495.2417 535.1978 569.4077 626.0263 661.9428 743.9153 792.1338 822.2487 861.2699 882.5107 900.4940 955.7388 962.0785 963.5456 982.3772 991.8709 1027.6037 1054.3120 1072.8217 1084.2930 1168.6621 1202.6298 1213.0228 1249.3313 1292.2152 1299.9946 1303.9171 1330.1739 1350.9173 1352.1116 1378.7870 1406.1912 1449.0433 1464.0750 1477.3573 1500.4609 1535.6151 1573.8717 1588.6656 2958.5056 2980.7069 2999.6951 3078.4397 3099.8458 3119.3921 3130.8781 3144.2821 3171.6006 3396.5544 3564.0440
redmass: 4.3462 4.7520 2.0304 6.0392 3.8829 2.1454 4.5537 2.6404 4.1410 1.4085 4.9675 2.5316 5.0078 1.4626 3.2106 3.0746 5.9375 6.9588 3.3006 1.1843 1.3836 4.0882 1.2792 1.5246 6.9830 3.1695 1.4496 1.4313 3.1766 4.3789 2.0880 1.5001 1.5975 3.7537 1.6175 1.3248 1.7334 1.3651 1.5369 1.9881 1.6014 1.2493 1.4575 1.2664 2.1138 1.0877 1.8768 1.0877 1.6546 7.2655 5.9727 5.6696 1.0692 1.0866 1.0636 1.0955 1.1002 1.0869 1.0894 1.0975 1.0959 1.0753 1.0664
irintensity: 1.3622 0.1570 8.2224 2.1493 0.2450 40.2243 8.6180 36.1619 12.5192 154.2315 4.8748 0.4064 3.5310 84.0890 36.3598 45.7399 12.6865 1.2602 1.2793 5.5636 32.9115 4.3976 8.1378 51.7710 12.3292 115.0617 6.0494 0.7010 2.2557 56.7358 0.3176 8.9853 4.3789 110.0951 81.9032 3.4014 29.3228 6.6215 6.7127 4.2505 0.6339 33.9799 35.4807 1.2024 23.2197 8.0850 10.1988 4.8187 50.7901 80.7305 224.6888 66.3801 63.7802 58.4563 66.3533 6.8930 25.6965 11.4490 28.8717 36.7016 6.5209 10.2819 10.2232
temp: 298.150 k
press: 1.00000 atm
elementType: 8 7 7 7 6 6 6 6 6 6 6 6 1 1 1 1 1 1 1 1 1 1 1
symmnumber: 1
zpe: 482139.9 jmol-1
zpe.correction: 0.183637 hartree
zpe.thermalcorrener: 0.195537 hartree
zpe.thermalcorrenthalpy: 0.196482 hartree
zpe.thermalcorrgfe: 0.143970 hartree
zpe.sumelectzpe: -549.970604 hartree
zpe.sumelectthermal: -549.958704 hartree
zpe.sumelectthermalent: -549.957760 hartree
zpe.sumelectthermalfe: -550.010271 hartree
dipole: -4.9323 -4.8894 0.1002
dipole: 6.9458
quadrupole: -75.9546 -66.3078 -74.0995
quadrupole: 5.8396 2.8969 -3.8943
quadrupole: -3.8340 5.8128 -1.9789 5.8396 2.8969 -3.8943
hfenergy: -550.1542412 hartree
pointgroup: C01 [X(C8H11N3O1)]
dipole: 1.9476914 1.6885537 -0.9070896 debye
dipolederiv: -0.9172982 0.2660368 -0.2021786 0.4100147 -0.4275634 -0.139083 -0.377063 -0.1522942 -0.4582947 -1.5846013 0.1593258 0.0868625 -0.7279275 0.0820978 0.0671671 0.5429086 -0.043532 -0.6162958 1.5750227 0.0019431 -0.3004066 0.3559288 -0.3288287 -0.0022402 -0.5196728 0.0715846 -0.008227 -0.5625954 -0.0129296 0.05866 -0.093357 -0.403041 0.0442941 0.0878947 0.0320087 -0.2781536 0.667846 -0.1068105 -0.0083154 -0.3954958 0.184478 0.0084369 -0.2133329 -0.0346663 0.251843 0.6529353 -0.1794089 0.0784707 -0.121055 0.4122982 0.0361076 0.2571173 0.0636555 0.2319418 0.937133 0.1123192 -0.1795955 0.2857979 0.0700834 -0.0445845 -0.2506688 -0.023791 0.1158311 -0.8664405 -0.0724011 0.1049437 0.5378617 0.3851115 -0.2184934 0.0308737 -0.1140949 -0.1602798 -0.621776 0.0445397 0.0744838 0.0042914 0.0438653 -0.041708 0.102023 -0.0503296 -0.1615829 -0.3005917 -0.1884156 0.0657807 -0.3269947 -0.2003407 0.0765806 0.1055937 0.0590684 -0.1446652 0.5074344 -0.1523645 -0.0898367 0.0066296 0.2007289 -0.05428 -0.1325416 -0.0211933 -0.0488926 0.2685129 0.1254164 -0.096341 0.0603812 0.3633693 -0.0973103 -0.0913159 -0.1172971 -0.0448432 -0.152072 -0.011398 0.1121244 -0.0517106 0.0480694 0.0924361 0.0871282 0.065952 -0.0331546 0.0509403 -0.0496724 -0.0367468 0.0469487 -0.0593151 -0.0819635 -0.0300411 -0.0344588 0.0492124 -0.0188754 -0.0118576 0.0807278 -0.0451652 0.0513324 0.0559205 0.0785038 0.0245754 0.0004703 -0.0006052 -0.0156435 -0.045038 -0.022216 -0.2165075 -0.1069673 -0.0415533 -0.052096 0.0100579 -0.028495 0.026279 0.0561436 0.0531267 -0.0310209 0.0619729 0.0233713 0.0092116 0.3463582 -0.0178902 -0.0240814 0.0479968 -0.0353735 -0.1829905 0.088403 0.0571907 0.0782199 0.1590249 0.0968751 -0.0501336 0.0255175 -0.0014854 -0.1113168 0.0547128 0.0147197 0.0653031 0.1432926 0.0250111 0.100189 0.0112145 0.0650558 0.0460702 0.0080264 0.0181636 -0.0004026 0.1481563 -0.0629711 0.1206988 0.0181572 0.12198 -0.0077814 0.0024581 0.0197784 0.0016779 0.1309189 0.0799516 -0.016384 0.0151274 -0.027336 -0.12261 0.0554298 0.0177358 0.0550597 0.1212887 0.2725498 -0.0652472 0.1222479 -0.0998999 0.2038116 0.134684 0.213187 0.1178389 0.2459932 unknown
polarizability: 212.5314261|0.2412435|106.4282853|-26.8669696|-12.0896829|64.2147856 unknown
InChI: InChI=1S/C8H11N3O/c12-6-5-10-11-7-8-1-3-9-4-2-8/h1-4,7,10,12H,5-6H2
charge 0 multiplicity 1
23 atoms
O  5.161287 -1.065766 0.582871
N  2.217467 0.746851 -0.991188
N  1.036534 0.200513 -0.590356
N  -3.901043 -0.642662 0.659242
C  3.42035 -0.08333 -0.910624
C  4.019433 -0.146361 0.518621
C  -1.335806 0.396639 -0.118644
C  -0.044683 0.960601 -0.515651
C  -2.483359 1.234134 -0.030845
C  -1.513798 -0.982876 0.19532
C  -3.721538 0.678256 0.355672
C  -2.789586 -1.442932 0.571253
H  4.167134 0.31978 -1.622546
H  3.161286 -1.106545 -1.231677
H  3.271781 -0.568921 1.208671
H  4.292497 0.871994 0.871107
H  2.302006 1.759145 -1.162222
H  -0.017913 2.043436 -0.752177
H  -2.412778 2.304026 -0.260356
H  -0.66152 -1.66602 0.140218
H  -4.616086 1.307908 0.428908
H  -2.949976 -2.499072 0.817213
H  5.920414 -0.689202 0.07009
