program: Gaussian 09
title: 000254950
version: EM64L-G09RevD.01
frameworkgroup: C1[X(C12H16N2)]
method: RPBEPBE
basis: SDD
operation: Freq
keyword: #pfreq=noraman
keyword: PBEPBE/SDD
title: #p freq=noraman PBEPBE/SDD
converged: YES YES NO NO
title: Mulliken charges:
elementType: N N C C C C C C C C C C C C H H H H H H H H H H H H H H H H
charge: -0.458221 -0.570264 0.205239 0.142041 0.166629 0.213925 -0.526817 -0.621840 -0.402428 -0.360938 0.460083 -0.804671 -0.353464 -0.830906 0.234965 0.187717 0.295605 0.241534 0.227679 0.192321 0.222919 0.243009 0.232589 0.236510 0.222754 0.223190 0.224396 0.223173 0.275060 0.258212
chargesum: 0.00000
title: Mulliken charges with hydrogens summed into heavy atoms:
elementType: N N C C C C C C C C C C C C
charge: -0.162616 -0.036992 0.205239 0.142041 0.166629 0.213925 -0.104135 -0.380306 0.017572 -0.138020 0.460083 -0.092564 -0.130711 -0.160147
polarizability: 1.94022132e+02 1.66022566e+01 1.61910704e+02 -8.07369820e+00 6.65914668e+00 8.28855749e+01
1716.lowfreq: -0.0005 -0.0005 -0.0003 2.0387 6.2186 9.6950 38.1671 44.7876 77.4498
frequency: 37.9810 44.6923 77.4268 84.8738 93.0166 107.0502 184.0154 193.7188 216.8577 229.7311 264.9100 318.5282 345.4245 360.3032 402.5340 432.2367 434.8032 480.8229 510.5074 572.1063 590.1508 592.1699 637.7811 665.7597 715.1475 761.9583 786.1349 797.5421 812.5306 853.1694 886.9358 929.9507 932.2704 947.7160 975.5476 1002.2899 1041.2599 1046.0102 1051.8501 1093.1450 1105.5035 1139.4878 1151.4529 1207.6056 1225.6616 1233.9649 1248.3570 1286.6487 1307.9488 1310.2934 1316.3261 1375.1226 1394.3629 1396.1580 1411.3083 1435.5741 1457.1960 1465.7432 1468.2594 1469.8059 1474.5294 1479.2187 1491.6155 1495.5016 1582.6873 1601.6066 1637.5369 1638.3002 2878.2692 2963.6508 2969.0646 2973.6262 3023.4487 3031.0944 3044.3501 3044.9107 3077.3231 3093.4570 3114.1428 3120.8940 3139.8640 3454.8218 3582.1189 3604.9183
redmass: 3.2790 1.0353 3.5502 1.9998 1.3507 1.8430 3.7180 2.2937 1.6117 2.2475 2.5420 2.7231 3.8735 3.2348 5.1278 4.8725 2.9598 1.1655 3.2147 3.2142 1.6866 2.3167 4.0331 4.8972 4.6777 3.4855 1.3554 1.4150 4.5058 3.5241 1.4102 2.1050 1.3509 2.0649 1.5384 1.5459 1.4611 1.5247 2.2862 2.7207 2.2470 1.3154 1.9551 2.2350 1.4202 1.4490 2.0298 1.1298 1.6152 3.2414 1.8612 1.3807 1.6723 1.2545 2.3636 2.5792 2.4696 1.3679 1.0525 1.0464 1.7481 1.1282 1.0928 1.9222 6.5759 6.0641 1.0963 6.8248 1.0717 1.0393 1.0372 1.0621 1.0885 1.0980 1.0977 1.0987 1.0982 1.0948 1.0868 1.0915 1.0970 1.0447 1.0975 1.0803
irintensity: 0.6300 0.5340 0.0585 4.1540 2.4953 3.3467 0.1082 7.3087 20.7118 20.2995 0.9469 7.8631 3.2345 7.5940 0.0970 0.3931 5.4337 83.7151 2.4896 55.1056 104.2852 103.8621 2.7204 0.7390 1.9793 1.1133 2.3447 52.5591 1.2769 0.5257 7.3127 3.2222 1.5191 2.2519 2.7209 10.6412 2.4458 11.5304 2.4830 18.2877 11.3803 6.7881 12.5758 2.4041 3.7695 7.8356 10.3769 3.6121 6.0158 32.4267 13.2779 11.5522 0.4714 8.2948 17.2680 33.7302 2.1746 15.7731 14.1652 11.8263 31.6122 7.7889 4.4280 22.3004 0.6055 18.6740 38.3979 0.5478 92.8330 73.2150 54.9612 44.0641 11.9955 23.5716 26.9529 46.6894 20.2660 16.6704 8.4427 20.8303 27.6825 1.8088 0.2489 44.9748
temp: 298.150 k
press: 1.00000 atm
elementType: 7 7 6 6 6 6 6 6 6 6 6 6 6 6 1 1 1 1 1 1 1 1 1 1 1 1 1 1 1 1
symmnumber: 1
zpe: 666526.9 jmol-1
zpe.correction: 0.253867 hartree
zpe.thermalcorrener: 0.268449 hartree
zpe.thermalcorrenthalpy: 0.269393 hartree
zpe.thermalcorrgfe: 0.211692 hartree
zpe.sumelectzpe: -575.355442 hartree
zpe.sumelectthermal: -575.340860 hartree
zpe.sumelectthermalent: -575.339916 hartree
zpe.sumelectthermalfe: -575.397617 hartree
dipole: 1.7598 2.3106 1.2164
dipole: 3.1488
quadrupole: -72.2916 -72.3914 -88.2824
quadrupole: 1.1452 1.5248 -1.3061
quadrupole: 5.3635 5.2637 -10.6272 1.1452 1.5248 -1.3061
hfenergy: -575.6093089 hartree
pointgroup: C01 [X(C12H16N2)]
dipole: -0.6701903 0.941146 -0.4470023 debye
polarizability: 193.0025234|-17.2120564|163.1389658|-9.3917739|-3.9572452|82.6769215 unknown
InChI: InChI=1S/C12H16N2/c1-8-3-4-12-11(7-8)10(5-6-13)9(2)14-12/h3-4,7,14H,5-6,13H2,1-2H3
charge 0 multiplicity 1
30 atoms
N  -0.097086 2.274697 -0.107355
N  -3.582286 -2.603623 -0.318263
C  -1.146262 0.292055 0.337666
C  0.276646 0.041781 0.163823
C  -1.341758 1.668473 0.163871
C  0.909477 1.302126 -0.112744
C  -2.195263 -0.756873 0.61238
C  1.076369 -1.131115 0.225399
C  -2.623735 -1.53428 -0.661877
C  2.300216 1.409585 -0.325779
C  2.469491 -1.047084 0.014858
C  -2.595069 2.495191 0.22453
C  3.063416 0.226946 -0.259936
C  3.348435 -2.286926 0.076918
H  -1.823638 -1.500484 1.342517
H  -3.096609 -0.297002 1.066658
H  0.041037 3.270625 -0.264091
H  0.614944 -2.102841 0.440616
H  -1.728198 -2.004342 -1.108826
H  -3.00488 -0.797338 -1.410435
H  2.778406 2.373565 -0.534741
H  -3.455086 1.865279 0.504385
H  -2.518756 3.307723 0.973509
H  -2.831133 2.963614 -0.751289
H  4.147351 0.279616 -0.422187
H  3.882237 -2.45384 -0.878372
H  4.118367 -2.198936 0.867434
H  2.753613 -3.192227 0.289944
H  -3.745433 -3.287572 -1.063015
H  -4.460414 -2.261991 0.085902
