program: Gaussian 09
title: 000254947
version: EM64L-G09RevD.01
frameworkgroup: C1[X(C7H12N2O)]
method: RPBEPBE
basis: SDD
operation: Freq
keyword: #p
keyword: freq=noraman
keyword: PBEPBE/SDD
title: #p freq=noraman PBEPBE/SDD
converged: NO YES NO NO
title: Mulliken charges:
elementType: O N N C C C C C C C H H H H H H H H H H H H
charge: -0.248999 -0.612643 -0.015312 -0.403134 -0.357407 -0.213226 -0.346318 -0.695153 0.193794 -0.208590 0.214828 0.250162 0.209833 0.213582 0.284149 0.199894 0.195733 0.212300 0.218643 0.212067 0.354826 0.340972
chargesum: 0.00000
title: Mulliken charges with hydrogens summed into heavy atoms:
elementType: O N N C C C C C C C
charge: -0.248999 0.083155 -0.015312 0.061855 0.066008 0.070923 0.049309 -0.052143 0.193794 -0.208590
polarizability: 8.82959309e+01 3.82125640e+00 9.54187215e+01 6.42822577e+00 6.12852581e+00 7.87465691e+01
1716.lowfreq: -13.4338 -0.0014 -0.0008 0.0002 6.3946 8.1005 44.2628 51.5182 71.2470
frequency: 43.9862 51.3889 71.2110 100.4199 126.8893 149.8836 208.2103 226.5130 257.7119 348.8133 384.2940 406.4738 470.5835 516.6920 566.1987 592.6442 650.9597 705.9598 731.6749 774.8276 802.3743 881.2987 905.7259 953.7450 989.0618 1055.3424 1071.6599 1092.3424 1102.2686 1137.6212 1192.3699 1218.1559 1259.6972 1281.8671 1293.4791 1304.9699 1332.8021 1339.6293 1361.8136 1389.6025 1454.4665 1467.7240 1476.0963 1477.7979 1487.7323 1595.6586 1655.6368 2176.0417 2963.6270 2971.5041 2973.6911 2994.1351 3004.3755 3006.3881 3030.9437 3066.4996 3072.2351 3073.9757 3507.8834 3658.2271
redmass: 4.7723 4.1081 1.7272 4.7560 2.4895 6.6073 3.7357 1.1621 2.4055 5.1916 2.8969 4.2204 6.0076 2.2839 3.5768 1.2808 1.6227 3.6774 1.0917 1.3578 3.3612 1.8293 1.8539 1.6766 2.4899 2.6655 1.9947 2.6059 2.1901 1.5793 1.4428 1.3338 1.3647 1.2740 1.1853 1.1739 2.6478 1.5756 1.5589 1.2153 1.0808 1.0707 1.0601 1.0509 1.0807 1.4118 3.9574 12.5255 1.0585 1.0594 1.0366 1.0699 1.0860 1.0842 1.1030 1.1029 1.1019 1.0993 1.0453 1.1044
irintensity: 12.9475 0.3406 0.1005 4.8700 0.1375 9.8881 3.2722 0.3645 4.0660 3.1450 0.4487 5.1764 4.8559 0.8104 13.1333 153.0378 130.5300 22.2245 13.3038 0.7162 2.2679 1.9129 6.8387 1.5059 1.4421 0.9910 0.6576 1.2600 4.4524 4.1314 21.0545 2.8795 4.0418 1.5848 4.0779 4.8435 86.8170 22.2805 2.7078 10.1432 9.9272 0.2641 6.9550 10.8130 15.8785 84.5649 302.1272 18.4915 2.7168 40.7449 39.7323 21.4386 7.5018 12.8748 20.2444 0.5955 92.3283 49.8590 40.3104 45.9653
temp: 298.150 k
press: 1.00000 atm
elementType: 8 7 7 6 6 6 6 6 6 6 1 1 1 1 1 1 1 1 1 1 1 1
symmnumber: 1
zpe: 481292.4 jmol-1
zpe.correction: 0.183315 hartree
zpe.thermalcorrener: 0.194998 hartree
zpe.thermalcorrenthalpy: 0.195942 hartree
zpe.thermalcorrgfe: 0.144693 hartree
zpe.sumelectzpe: -457.889642 hartree
zpe.sumelectthermal: -457.877958 hartree
zpe.sumelectthermalent: -457.877014 hartree
zpe.sumelectthermalfe: -457.928263 hartree
dipole: -0.2264 -0.3425 0.6505
dipole: 0.7692
quadrupole: -56.7187 -78.3528 -54.8710
quadrupole: -2.3419 4.7796 -5.4095
quadrupole: 6.5955 -15.0387 8.4432 -2.3419 4.7796 -5.4095
hfenergy: -458.0729565 hartree
pointgroup: C01 [X(C7H12N2O1)]
dipole: -0.0676158 0.1315049 -0.2640595 debye
dipolederiv: -0.5240911 0.0299369 0.1464783 0.1632345 -1.0057315 -0.2548021 0.1538586 -0.0528962 -0.5338728 -0.8769598 0.035309 0.2005426 -0.0445561 -0.3293308 -0.0280293 0.2485011 -0.0905769 -0.871596 -0.2602809 0.0773268 -0.0087001 0.0674745 -0.3543809 0.0325655 0.0310566 -0.0846677 -0.2260897 0.2470822 0.0189738 -0.0640103 0.0311224 0.0405056 -0.0392109 0.0070626 -0.0548206 0.1123363 -0.081229 -0.008762 -0.0186175 -0.0087895 0.1607634 -0.0073757 -0.0127496 -0.0122629 0.014336 -0.0293896 -0.0182492 0.0702857 -0.0726718 -0.222248 0.0544571 0.1038121 0.066544 0.0724588 0.1005129 -0.0007111 -0.0231002 -0.0052008 0.1739532 -0.0121344 -0.0785114 -0.0097874 0.0816205 -0.0271039 -0.0064822 -0.066409 -0.0055831 0.0909801 -0.0073064 -0.0370217 -0.006821 0.0019231 0.7120625 -0.0267976 -0.5408564 -0.0504414 1.2654484 0.173821 -0.6236749 -0.0364054 0.9051321 -0.0436169 -0.1895192 0.0106035 -0.1534139 0.1920937 0.0553958 -0.0335305 0.2403866 -0.0382179 0.0072915 -0.0612902 0.0406763 -0.0545151 -0.0298216 0.1303609 0.0083491 0.0896236 -0.0266559 0.0351643 0.0613251 0.018041 0.0571303 -0.012319 -0.0996761 -0.0176344 -0.0533414 0.0338602 0.0321317 -0.0453739 0.0366445 -0.0552412 -0.0526662 0.1080465 0.0502246 0.0927396 -0.0360567 0.0273697 0.0546809 0.0269823 0.0647246 -0.0786243 -0.0937692 0.0291826 -0.0776301 0.004733 0.0412501 0.0229712 -0.0555166 0.0130361 0.0397487 -0.0157685 -0.0605793 -0.0195679 0.0123003 0.0225256 0.0275989 0.0042229 0.0653256 -0.0979244 -0.125561 0.0302493 -0.1087743 -0.0175449 0.0185359 -0.027742 0.007061 -0.0601269 -0.066236 0.1384289 0.0385557 0.1206292 -0.0618415 0.0822539 -0.0691634 0.049652 -0.0371187 -0.0684874 0.1346883 0.0019264 0.0988674 -0.0319733 -0.2283041 -0.0060024 -0.0132888 -0.0040565 0.1010774 -0.003342 0.0128645 -0.002369 0.0665315 0.0785007 0.0814275 0.0412796 0.0411078 -0.0988252 -0.1219155 -0.0029588 -0.0875308 0.0042436 0.3394228 0.0344232 0.0610511 0.0257057 0.1931072 -0.0138661 0.0573809 -0.0279621 0.2700622 0.3268716 0.0161199 0.0769778 0.0228535 0.1589175 -0.0050066 0.0936366 0.0166231 0.2643112 unknown
polarizability: 91.3494626|-5.1549646|93.875088|-5.5237751|5.0970826|77.2366708 unknown
InChI: InChI=1S/C7H12N2O/c1-2-3-4-6(5-8)7(9)10/h6H,2-4,9H2,1H3
charge 0 multiplicity 1
22 atoms
O  0.95941 2.616734 0.919293
N  2.178168 1.302836 -0.5617
N  1.825057 -2.054961 0.202899
C  -0.683256 0.186813 1.398006
C  -1.42441 0.047255 0.052093
C  0.875514 0.196661 1.272012
C  -2.959544 0.041241 0.233527
C  -3.717123 -0.076918 -1.106175
C  1.342912 1.482615 0.517282
C  1.395188 -1.052216 0.690383
H  -0.974537 -0.635548 2.079059
H  -0.958031 1.141376 1.883776
H  -1.142198 0.886064 -0.615837
H  -1.112206 -0.887834 -0.456207
H  1.294434 0.293655 2.29415
H  -3.268141 0.970693 0.753684
H  -3.246015 -0.79956 0.897754
H  -3.473831 0.770285 -1.774768
H  -4.811478 -0.080981 -0.951075
H  -3.446962 -1.010511 -1.634868
H  2.473238 0.377103 -0.872897
H  2.509211 2.128499 -1.060891
