program: Gaussian 09
title: 000254929
version: EM64L-G09RevD.01
frameworkgroup: C1[X(C16H14ClN5O3)]
method: RPBEPBE
basis: SDD
operation: Freq
keyword: #p
keyword: freq=noraman
keyword: PBEPBE/SDD
title: #p freq=noraman PBEPBE/SDD
converged: YES YES NO NO
title: Mulliken charges:
elementType: Cl O O O N N N N N C C C C C C C C C C C C C C C C H H H H H H H H H H H H H H
charge: 0.048255 -0.237324 -0.291492 -0.257285 -0.159167 -0.455649 -0.024865 -0.100527 0.065196 -0.534568 0.205619 0.144358 0.204010 -0.194010 0.491596 -0.345154 -0.433760 0.238728 -0.301703 -0.353798 -0.317851 -0.339256 0.180269 -0.220250 -0.674796 0.260283 0.272590 0.283611 0.373691 0.308011 0.231149 0.271612 0.271171 0.260152 0.230394 0.229259 0.228702 0.229552 0.213248
chargesum: 0.00000
title: Mulliken charges with hydrogens summed into heavy atoms:
elementType: Cl O O O N N N N N C C C C C C C C C C C C C C C C
charge: 0.048255 -0.237324 -0.291492 -0.257285 -0.159167 -0.081958 -0.024865 -0.100527 0.065196 -0.001695 0.205619 0.144358 0.204010 0.089601 0.491596 -0.037143 -0.202611 0.238728 -0.301703 -0.082186 -0.046681 -0.079104 0.180269 0.239403 -0.003293
polarizability: 3.32171247e+02 1.56881561e+01 2.56137234e+02 -1.18457925e+01 -2.04811068e+01 1.39786902e+02
1716.lowfreq: -3.1917 -0.0019 -0.0012 0.0013 1.4848 2.5536 15.7859 19.6162 37.8800
frequency: 15.7808 19.5449 37.8773 42.2821 50.4496 63.3739 76.0876 84.4038 97.6695 119.9121 135.3127 156.2856 176.8512 200.6819 216.8774 240.4148 251.0841 252.3874 285.2481 313.7946 334.1188 337.8827 369.7909 385.9866 399.2174 414.3666 469.9621 493.0892 523.6544 539.1021 549.6506 568.0335 613.9461 624.9128 630.4225 636.8119 654.5116 681.0293 700.6642 761.0898 770.1462 786.8224 793.4833 798.5214 818.7571 830.6391 838.1222 847.6987 849.6084 886.3607 895.5294 901.4523 918.3455 928.7837 948.8130 980.5720 1005.6957 1012.8656 1022.8075 1064.1648 1094.0074 1106.8007 1111.9626 1125.2137 1136.4879 1151.1006 1184.1313 1189.4562 1219.9301 1247.5669 1249.1517 1249.5139 1285.6393 1286.4175 1301.5896 1309.6792 1324.0418 1340.7947 1359.1699 1373.6941 1378.6598 1399.4566 1399.8149 1423.7104 1433.6043 1464.2670 1465.8074 1473.6737 1486.8096 1502.8483 1515.1073 1547.0759 1562.2369 1595.6666 1620.0847 1624.9871 1648.0773 2995.1140 3009.3540 3015.4776 3067.2208 3091.9127 3106.3004 3119.8030 3128.3288 3157.5518 3178.1075 3187.7363 3199.1226 3220.7668 3235.7462
redmass: 6.4912 5.1380 6.3226 3.9489 5.8911 4.4976 4.7697 6.2357 6.5343 3.5511 6.3640 7.0151 4.9412 5.1767 9.2394 5.1805 1.9658 2.0954 4.7963 6.2321 6.1665 5.3325 4.8108 9.7837 4.0150 2.9872 5.3782 5.5518 3.4068 4.8773 6.3813 6.3933 5.7769 7.4236 7.1555 4.7949 8.0629 4.1779 6.3459 4.3808 6.3978 7.0202 5.4379 1.1164 8.1842 2.3098 1.8186 2.7350 2.1521 1.3952 2.7627 2.0174 1.4383 4.4584 2.2742 1.3659 3.3651 1.3342 2.2893 4.9189 3.7929 4.2882 2.2168 1.3699 1.4695 3.8960 1.1652 2.5569 3.5508 2.0437 2.6382 1.1661 3.0275 4.5570 3.6141 1.5008 1.3446 2.1233 1.4165 4.2441 5.2609 1.2730 1.9752 4.1791 1.8013 1.0405 1.8090 1.0589 1.0753 2.6643 8.1952 3.3731 8.7725 5.0603 9.0677 5.5310 2.3841 1.0357 1.0581 1.0651 1.1065 1.0985 1.1026 1.0993 1.0903 1.0911 1.0947 1.0929 1.0950 1.0846 1.0994
irintensity: 0.4801 1.6647 1.1490 1.4939 0.5342 0.6266 1.6045 2.3041 6.2925 1.4057 3.3784 2.4245 0.7481 3.2404 2.7079 11.4444 1.5952 1.7160 2.2872 1.2219 2.1181 5.4139 10.3911 7.2645 11.7519 0.0085 5.2481 6.6444 14.2030 3.6650 9.0776 6.6596 0.7171 1.2580 1.8055 25.8498 5.1479 29.8854 14.4380 11.6640 5.6815 7.6585 12.7646 3.4724 26.9737 14.9896 10.1749 6.2307 9.1515 10.3638 217.3022 38.4257 11.4715 22.9703 20.5835 1.6897 25.8137 0.5639 38.6400 410.6979 31.3106 37.9388 3.0089 17.3518 5.7375 127.3153 131.4636 8.0702 14.4122 174.1973 228.6630 12.7589 47.2477 120.0375 50.3095 45.8223 4.7313 14.4600 6.7161 21.5482 128.0276 20.2364 63.4770 21.7800 45.2991 12.1115 63.8822 6.1083 18.4706 54.3463 184.6457 163.6029 68.9387 418.4770 172.6687 106.4474 125.9643 22.2814 23.4324 12.0740 7.8370 33.9353 45.6172 1.1510 15.2519 1.5779 1.3253 5.6232 2.4459 575.5353 0.9497
temp: 298.150 k
press: 1.00000 atm
elementType: 17 8 8 8 7 7 7 7 7 6 6 6 6 6 6 6 6 6 6 6 6 6 6 6 6 1 1 1 1 1 1 1 1 1 1 1 1 1 1
symmnumber: 1
zpe: 749607.2 jmol-1
zpe.correction: 0.285510 hartree
zpe.thermalcorrener: 0.307656 hartree
zpe.thermalcorrenthalpy: 0.308601 hartree
zpe.thermalcorrgfe: 0.230332 hartree
zpe.sumelectzpe: -1575.840070 hartree
zpe.sumelectthermal: -1575.817924 hartree
zpe.sumelectthermalent: -1575.816980 hartree
zpe.sumelectthermalfe: -1575.895249 hartree
dipole: 0.4577 -0.3935 3.6978
dipole: 3.7468
quadrupole: -160.6721 -155.0083 -152.0674
quadrupole: 33.7280 3.1696 2.8316
quadrupole: -4.7561 0.9076 3.8485 33.7280 3.1696 2.8316
hfenergy: -1576.1255804 hartree
pointgroup: C01 [X(C16H14Cl1N5O3)]
dipole: 0.1947998 -0.8244643 -1.2063464 debye
polarizability: 333.7252911|5.2522516|185.6752242|18.6698563|-58.9174233|208.6948678 unknown
InChI: InChI=1S/C16H14ClN5O3/c1-2-25-16(24)10-3-5-11(6-4-10)21-12(23)7-22-9-20-13-14(17)18-8-19-15(13)22/h3-6,8-9,21H,2,7H2,1H3
charge 0 multiplicity 1
39 atoms
Cl 5.229517 3.215228 -1.365527
O  0.627521 -2.42517 2.426239
O  -5.857037 0.507274 -0.648248
O  -6.159348 -0.360525 1.495805
N  3.208054 -0.992435 0.568601
N  0.181965 -1.44565 0.321727
N  4.794275 0.665687 0.801828
N  2.131052 -0.225955 -1.522054
N  3.172938 1.79263 -2.412343
C  2.460264 -2.240248 0.815935
C  3.047592 -0.140794 -0.520139
C  4.045236 0.883158 -0.365597
C  0.992628 -2.033416 1.27969
C  4.26721 -0.453909 1.325845
C  -1.202021 -1.134701 0.419709
C  -1.99159 -1.431972 1.56508
C  -1.799971 -0.498348 -0.704876
C  -3.956222 -0.45522 0.449495
C  4.048603 1.854245 -1.3917
C  -3.355731 -1.089863 1.566593
C  -3.162478 -0.161629 -0.690382
C  2.25608 0.775338 -2.4423
C  -5.404908 -0.1212 0.518511
C  -7.302962 0.881382 -0.663685
C  -7.564973 1.574266 -1.997115
H  2.969605 -2.797832 1.615914
H  2.479562 -2.844742 -0.110022
H  4.604164 -0.925986 2.246963
H  0.651676 -1.150736 -0.558026
H  -1.531834 -1.919926 2.425645
H  -1.189523 -0.271459 -1.587293
H  -3.980828 -1.31021 2.438169
H  -3.624437 0.327891 -1.55172
H  1.558324 0.773513 -3.282676
H  -7.501789 1.538108 0.202565
H  -7.90123 -0.039415 -0.538749
H  -7.344763 0.900354 -2.84277
H  -6.942505 2.479593 -2.099785
H  -8.627017 1.873973 -2.059407
