program: Gaussian 09
title: 000254924
version: EM64L-G09RevD.01
frameworkgroup: C1[X(C8H10N4O)]
method: RPBEPBE
basis: SDD
operation: Freq
keyword: #p
keyword: freq=noraman
keyword: PBEPBE/SDD
title: #p freq=noraman PBEPBE/SDD
converged: YES YES NO NO
title: Mulliken charges:
elementType: O N N N N C C C C C C C C H H H H H H H H H H
charge: -0.253858 -0.426362 -0.036725 -0.626566 -0.027614 0.112064 -0.524497 0.282003 -0.448766 -0.009211 -0.789851 0.139246 -0.150066 0.210848 0.260662 0.243565 0.316322 0.308892 0.253950 0.234309 0.260582 0.312052 0.359020
chargesum: 0.00000
title: Mulliken charges with hydrogens summed into heavy atoms:
elementType: O N N N N C C C C C C C C
charge: -0.253858 -0.117470 -0.036725 0.044505 -0.027614 0.112064 -0.052987 0.282003 0.111121 -0.009211 -0.041009 0.139246 -0.150066
polarizability: 1.68920052e+02 -9.61395855e+00 1.15572736e+02 1.02415746e+01 -1.73108269e+00 6.44640991e+01
1716.lowfreq: -3.4457 0.0007 0.0008 0.0012 3.4424 11.7856 44.2855 51.5031 56.6156
frequency: 44.2330 51.4968 56.5604 79.2557 121.9616 170.0631 177.4676 196.7498 234.2368 293.8677 316.0386 345.8773 374.1166 385.2002 467.3170 503.4519 523.2644 539.4021 559.1351 566.6679 579.3540 612.2140 698.3229 750.7645 760.0349 782.5070 911.8082 934.9830 947.4992 1011.7404 1015.8866 1045.2595 1046.5573 1100.9942 1165.1375 1193.7881 1221.4624 1260.3326 1278.1418 1320.0184 1331.4572 1383.1382 1407.0683 1447.9730 1456.1156 1458.6687 1471.1052 1482.9918 1556.0103 1593.2362 1636.0695 1661.2413 2193.7177 2978.5109 2996.6427 3016.7620 3049.9939 3055.9380 3084.3580 3130.7789 3535.8768 3552.2291 3703.7105
redmass: 4.0119 2.8739 1.5198 2.2865 5.3718 3.2775 7.5260 8.2001 1.1308 2.8045 2.5671 4.7118 4.6933 3.9250 5.5985 6.1121 1.1338 5.7282 4.0685 1.2821 3.7226 6.1983 9.0518 1.5787 3.9003 5.1962 2.6785 2.7776 3.9720 3.8678 2.2141 1.5542 1.6001 2.6934 2.9457 1.5047 4.0428 1.3220 1.1823 1.7650 1.4148 2.7493 1.4049 2.1255 1.3544 1.1800 1.1098 1.0877 7.1394 1.5031 2.4642 6.4880 12.4073 1.0411 1.0590 1.0603 1.0981 1.0998 1.1027 1.0939 1.0769 1.0463 1.1052
irintensity: 1.9476 3.4333 0.3146 6.9788 12.4288 0.1108 1.7863 1.4854 64.7328 6.6915 1.3262 5.0396 3.2490 0.8756 4.3167 0.5314 343.2175 6.8640 2.0613 26.8374 6.0583 1.0346 7.8883 10.0013 7.0185 4.6019 4.2907 0.6628 9.6905 0.7475 10.3792 8.0537 8.4865 4.3933 21.4932 6.7326 12.9032 16.8537 41.3483 68.1522 3.5182 22.2690 38.0342 118.4359 43.9065 55.9686 33.2150 21.3054 500.9524 16.7168 377.3410 273.0525 23.3927 24.7762 12.5402 17.9308 14.6432 13.8306 10.5027 9.4965 22.6426 106.9098 43.5883
temp: 298.150 k
press: 1.00000 atm
elementType: 8 7 7 7 7 6 6 6 6 6 6 6 6 1 1 1 1 1 1 1 1 1 1
symmnumber: 1
zpe: 465507.4 jmol-1
zpe.correction: 0.177302 hartree
zpe.thermalcorrener: 0.190637 hartree
zpe.thermalcorrenthalpy: 0.191581 hartree
zpe.thermalcorrgfe: 0.136530 hartree
zpe.sumelectzpe: -604.129432 hartree
zpe.sumelectthermal: -604.116097 hartree
zpe.sumelectthermalent: -604.115153 hartree
zpe.sumelectthermalfe: -604.170204 hartree
dipole: -9.4738 7.4985 -1.3304
dipole: 12.1553
quadrupole: -81.9935 -79.5022 -76.1138
quadrupole: -7.2374 2.5220 1.5914
quadrupole: -2.7903 -0.2990 3.0893 -7.2374 2.5220 1.5914
hfenergy: -604.3067343 hartree
pointgroup: C01 [X(C8H10N4O1)]
dipole: 3.5830125 -3.1609035 -0.2017471 debye
dipolederiv: -0.890498 0.2998302 0.0224205 0.394665 -1.0137068 -0.0082757 -0.0177686 -0.0087585 -0.3802562 -1.0676844 0.0872006 0.0972776 -0.4354131 -0.7521216 0.1116263 0.1745343 0.0325545 -0.2571637 -1.4633685 0.3155409 0.149951 0.4546225 -0.6438794 -0.051095 0.1498697 -0.0162824 -0.3320202 -1.6177587 -0.0410389 0.1409093 -0.066369 -0.2267849 -0.0449305 0.1915302 -0.0489813 -0.7760726 -0.4530023 0.0275465 -0.0271521 -0.0319291 -0.2392049 -0.0007913 0.0661561 -0.007985 -0.2387503 -0.0239895 -0.1060902 -0.0076742 0.1173461 -0.7050242 0.0696969 -0.093988 0.0887882 -0.0942085 0.0881939 -0.0021169 0.03794 0.0238731 0.1249331 -0.0127748 0.1235302 -0.0181544 0.1076351 0.8092112 -0.2926629 -0.108464 -0.0410376 0.5356223 -0.0634164 -0.1452504 -0.0345581 0.0098491 -0.1698078 -0.0062737 0.0070082 -0.1026469 0.1638138 0.0476645 0.0537921 0.0538096 0.1481402 1.4259419 -0.2827129 -0.1465843 -0.4403138 1.2982611 -0.047463 -0.1521713 -0.0631214 0.226001 -0.0422468 -0.0005225 0.0104926 -0.0990148 -0.1348474 0.0426411 0.0172061 0.0679468 0.0843555 2.0779648 -0.0844001 -0.2843517 -0.0479996 1.0691413 -0.0261105 -0.2967416 -0.0328076 0.2977705 0.334546 0.0030229 -0.0432627 0.0514929 -0.0521061 -0.0015218 -0.1888126 0.0180934 -0.0767357 0.0103491 -0.0428967 0.0044328 -0.0811299 -0.0917433 0.0992585 -0.0143171 0.0623731 0.0403928 0.044394 0.0176974 0.0126437 0.0499736 0.0301784 -0.0952757 -0.0098057 -0.0396682 -0.0071154 0.0301642 0.0246484 0.022416 0.0162967 0.0461415 -0.1062044 0.0088037 -0.0674073 -0.0158654 0.1970339 -0.0248936 0.0326137 0.0865685 0.0396774 0.0554644 0.0717462 0.000589 0.1129038 0.1531757 0.0096569 0.0299174 0.0101477 0.1250665 0.0056836 0.0412628 -0.0023857 0.3154906 0.0742793 0.0339788 -0.0791955 0.0160029 0.0032795 0.0497697 -0.0755232 0.0961846 -0.042831 0.0595779 0.0699295 0.0841425 0.0297226 -0.0171394 -0.0566005 0.0750854 -0.122633 -0.0169735 -0.0806869 -0.0587758 0.0018808 0.011043 0.1207246 0.0012937 0.0033423 0.0055546 0.1082303 0.2381509 0.0083452 0.0254664 -0.0035992 0.1231721 0.0279554 0.0085737 0.0293598 0.3933804 0.2660602 0.0449868 0.017172 0.0876983 0.1965464 0.0034055 0.0089457 0.0074893 0.3938433 unknown
polarizability: 167.6650043|-13.2142215|116.3890714|-9.9995031|-3.7238925|64.9028111 unknown
InChI: InChI=1S/C8H10N4O/c1-5-6(3-2-4-9)7(13)12-8(10)11-5/h11H,2-3,10H2,1H3
charge 0 multiplicity 1
23 atoms
O  -0.094329 2.218862 0.05285
N  2.122681 -1.187954 -0.062711
N  1.998329 1.201377 -0.202035
N  4.053357 0.124066 -0.486171
N  -4.972986 0.101116 -0.168124
C  -0.029228 -0.180336 0.280135
C  -1.5101 -0.168144 0.595058
C  0.743456 -1.322886 0.210154
C  -2.356662 0.256013 -0.649919
C  0.603825 1.155679 0.038301
C  0.291716 -2.75151 0.412712
C  2.694124 0.073314 -0.244701
C  -3.802667 0.178351 -0.392033
H  -1.862313 -1.143324 0.971014
H  -1.692559 0.580893 1.387125
H  -2.117206 -0.389499 -1.516273
H  -2.076898 1.292824 -0.912485
H  2.689543 -2.034831 -0.131077
H  0.669337 -3.157087 1.371145
H  0.663321 -3.40488 -0.399962
H  -0.803891 -2.830736 0.423934
H  4.660498 -0.690756 -0.493152
H  4.448451 1.051748 -0.623185
