program: Gaussian 09
title: 000254906
version: EM64L-G09RevD.01
frameworkgroup: C1[X(C20H25Cl2N3O3)]
method: RPBEPBE
basis: SDD
operation: Freq
keyword: #p
keyword: freq=noraman
keyword: PBEPBE/SDD
title: #p freq=noraman PBEPBE/SDD
converged: YES YES NO NO
title: Mulliken charges:
elementType: Cl Cl O O O N N N C C C C C C C C C C C C C C C C C C C C H H H H H H H H H H H H H H H H H H H H H H H H H
charge: -0.055357 -0.055717 -0.286927 -0.246241 -0.319980 -0.414696 -0.414570 -0.079618 -0.591291 0.403193 -0.159540 0.089629 0.230771 -0.433402 -0.382536 0.221898 -0.354577 -0.265953 -0.222971 0.232280 -0.373314 -0.389373 -0.424513 -0.069566 -0.257476 -0.586691 -0.535823 -0.657385 0.262640 0.238834 0.291663 0.283087 0.302664 0.334898 0.250128 0.226306 0.212175 0.221399 0.251591 0.263447 0.241482 0.248439 0.226303 0.273493 0.224144 0.238862 0.299717 0.263788 0.265856 0.285732 0.231183 0.246336 0.215578
chargesum: 0.00000
title: Mulliken charges with hydrogens summed into heavy atoms:
elementType: Cl Cl O O O N N N C C C C C C C C C C C C C C C C C C C C
charge: -0.055357 -0.055717 -0.286927 -0.246241 -0.319980 -0.112032 -0.079672 -0.079618 -0.089816 0.403193 0.132123 0.089629 0.230771 -0.150315 -0.132409 0.221898 -0.128270 -0.053779 -0.001573 0.232280 0.141723 0.100548 -0.198210 0.203927 0.205531 -0.023186 0.015766 0.035712
polarizability: 3.44687753e+02 2.54093354e+01 2.63021426e+02 -1.61247568e+01 2.95641295e+01 2.10652491e+02
1716.lowfreq: -6.7401 -3.3204 -0.0025 -0.0021 -0.0014 1.8627 6.9175 10.0418 15.8681
frequency: 5.2423 9.5299 15.7135 19.1853 25.2471 29.5107 38.4727 46.5547 61.9755 63.2166 74.5232 77.0656 94.8819 102.8545 112.1272 124.6049 143.2144 162.8374 182.9803 206.2441 214.1995 220.3470 230.0066 234.9311 249.4342 287.9750 296.2821 314.5117 328.9705 349.7495 355.7233 401.3637 423.5191 449.5193 456.5793 466.7770 486.4036 506.8119 514.1720 535.3465 546.6919 557.8641 575.1798 578.9661 596.2016 607.2960 636.7618 680.5300 686.3364 696.0895 725.7343 740.7065 748.5266 750.2846 765.8899 782.1193 789.9076 808.2180 817.9717 823.6420 839.3484 850.9957 864.9814 881.9214 904.5340 909.6333 933.0606 954.7563 960.7507 970.3388 976.1637 992.1944 1005.3372 1012.2074 1017.3444 1032.5467 1044.8522 1065.5575 1094.4102 1098.1497 1105.3178 1129.1294 1131.4719 1151.1974 1152.4162 1156.5840 1167.9627 1179.2068 1197.7184 1218.9836 1228.2806 1236.7150 1241.4427 1260.8199 1262.1541 1276.9398 1279.9511 1289.4067 1294.8973 1297.2526 1317.5999 1342.5580 1347.4634 1351.8291 1355.5595 1357.5000 1366.2105 1391.2114 1392.1378 1405.6863 1421.4504 1438.0470 1452.6964 1457.6083 1458.7825 1459.6986 1461.4799 1468.8010 1479.0259 1480.6851 1482.2400 1492.7600 1557.3515 1558.5141 1583.9887 1629.8820 1640.5679 1657.8557 2978.1622 2992.4788 3000.8075 3014.3485 3020.0355 3031.9148 3051.8037 3060.5599 3064.1917 3073.0326 3088.5954 3093.1352 3093.4778 3107.6474 3119.3296 3120.6272 3129.6319 3130.5839 3140.5637 3146.0326 3148.8728 3161.3984 3220.3311 3563.6540 3612.1105
redmass: 7.6334 6.7683 5.8734 3.1215 9.4155 6.2067 6.2958 6.9815 8.9423 5.2344 7.2598 4.2085 4.1352 2.8160 3.4419 4.4985 5.0254 4.6571 1.7438 3.0523 3.1031 4.0665 4.6897 3.3965 3.8562 3.0738 4.0516 3.6901 3.3441 4.0052 3.1672 3.4931 2.8673 3.0923 3.1399 3.0636 3.5304 1.8437 2.0321 1.7116 3.2693 3.2741 3.4795 3.4718 3.9934 5.0862 3.5773 5.5350 5.3534 4.7077 4.6167 2.8551 1.7136 2.9640 3.2281 1.1821 1.9964 1.9236 1.5033 2.0587 2.6518 1.4969 4.8458 3.1665 2.1086 3.1084 1.3771 2.3380 2.2806 1.2959 1.2293 4.2419 1.6019 2.1689 3.0930 1.7465 3.8770 3.7284 1.7105 2.1824 2.3185 1.6194 1.6274 1.4042 1.7681 1.6341 1.1548 1.5332 1.5759 1.3939 1.5314 1.7499 2.2117 1.2161 1.3011 1.1819 1.2080 1.5002 1.9786 1.2194 1.5128 1.4048 1.2801 1.7680 1.3760 1.3448 1.5810 4.7376 1.2554 2.0855 2.3068 1.0973 1.0906 2.9750 1.1637 1.1358 1.0599 1.1213 1.8484 1.0657 3.0354 1.3043 5.9137 5.8951 6.1155 6.8539 9.7325 5.4878 1.0651 1.0361 1.0776 1.0646 1.0637 1.0590 1.0624 1.0563 1.0923 1.1030 1.0975 1.1033 1.1013 1.0916 1.1065 1.0847 1.0910 1.0898 1.1109 1.1118 1.0945 1.0998 1.0985 1.0778 1.0808
irintensity: 0.2682 0.2223 0.7895 0.5371 0.7744 0.8511 0.5492 1.3911 9.8640 1.3106 5.4628 0.3774 2.2129 7.5017 0.3178 0.9296 2.5887 0.5973 1.8183 3.3250 4.1337 8.0296 2.0439 2.2119 7.3037 7.0499 1.3786 3.9240 11.7561 3.5114 2.5524 2.7104 17.4639 8.4351 5.8534 6.4069 8.3023 35.8947 41.4666 90.1807 51.8329 10.0550 1.4373 13.7919 24.6853 19.0544 3.1056 1.8780 54.0362 1.5578 6.4065 4.1378 91.8381 34.5344 16.3623 4.1703 18.0387 69.7589 1.9107 7.1256 4.0973 0.5100 0.6785 5.5099 25.5642 14.0778 3.7174 17.7637 29.0979 0.6626 34.3991 8.3572 13.3690 10.7710 90.7945 6.1079 2.6383 44.2676 54.3711 32.0557 14.2412 68.4073 49.0342 57.7028 92.0300 7.8721 19.4052 73.0506 87.3511 5.4248 108.0262 26.8912 47.5731 13.7632 11.5988 13.2854 5.1704 13.6708 8.3851 31.5418 12.8150 8.6894 32.6994 18.5841 85.6316 52.6057 17.8493 35.4551 21.1249 92.6139 2.9414 9.4063 15.2624 1.6519 40.4314 10.8453 12.2744 17.5358 280.3304 16.1393 1.7740 111.8266 45.2224 286.1721 0.2328 1.7937 141.6692 511.6146 37.7556 16.2604 13.4255 21.8618 10.7373 32.9122 16.4850 16.1303 12.0575 9.5093 44.5760 1.5195 2.8079 2.5364 24.8410 1.9991 15.9595 15.4963 16.5351 11.8575 29.0381 23.0402 0.2705 54.5496 60.7498
temp: 298.150 k
press: 1.00000 atm
elementType: 17 17 8 8 8 7 7 7 6 6 6 6 6 6 6 6 6 6 6 6 6 6 6 6 6 6 6 6 1 1 1 1 1 1 1 1 1 1 1 1 1 1 1 1 1 1 1 1 1 1 1 1 1
symmnumber: 1
zpe: 1109374.7 jmol-1
zpe.correction: 0.422539 hartree
zpe.thermalcorrener: 0.451913 hartree
zpe.thermalcorrenthalpy: 0.452857 hartree
zpe.thermalcorrgfe: 0.353910 hartree
zpe.sumelectzpe: -2085.102861 hartree
zpe.sumelectthermal: -2085.073487 hartree
zpe.sumelectthermalent: -2085.072543 hartree
zpe.sumelectthermalfe: -2085.171490 hartree
dipole: -0.2951 2.1906 0.9499
dipole: 2.4058
quadrupole: -146.8410 -191.9720 -179.2796
quadrupole: -9.1829 -30.4958 -7.3792
quadrupole: 25.8565 -19.2745 -6.5820 -9.1829 -30.4958 -7.3792
hfenergy: -2085.5253998 hartree
pointgroup: C01 [X(C20H25Cl2N3O3)]
dipole: -0.1325395 -0.7610214 -0.5469667 debye
polarizability: 341.9311251|-32.4227015|251.0010913|14.3780216|36.5441545|225.4294535 unknown
InChI: InChI=1S/C20H25Cl2N3O3/c1-2-28-20(27)18(13-15-14-23-17-6-4-3-5-16(15)17)24-19(26)7-10-25(11-8-21)12-9-22/h3-7,10,14,18,23-24H,2,8-9,11-13H2,1H3
charge 0 multiplicity 1
53 atoms
Cl 3.91893 -2.763471 -2.762408
Cl 7.227558 1.509505 -0.399973
O  -1.903231 2.418855 -1.507531
O  -3.371773 3.272269 0.093641
O  1.058959 1.691396 2.160544
N  -4.411608 -1.34006 -0.148467
N  -0.196329 1.442336 0.21986
N  4.437761 -0.141531 0.405096
C  -2.190914 1.023327 1.729812
C  -2.838138 -0.106137 0.969789
C  -1.381225 2.036023 0.834235
C  -2.225091 -1.347735 0.51756
C  -3.236549 -2.100063 -0.182066
C  -4.16842 -0.14565 0.546784
C  -0.925439 -1.909431 0.647965
C  -2.322487 2.65421 -0.196538
C  -2.983185 -3.367143 -0.753565
C  -0.667603 -3.17345 0.083173
C  -1.683348 -3.893871 -0.614231
C  0.980016 1.292238 0.943727
C  4.507501 -0.703321 -0.957666
C  5.638173 -0.147742 1.259221
C  2.0885 0.641326 0.214804
C  3.282129 0.459334 0.872898
C  -2.788386 2.923764 -2.604386
C  3.874728 -2.107696 -0.991726
C  6.416198 1.175735 1.274796
C  -3.799777 1.8476 -3.006632
H  -1.474706 0.646297 2.482084
H  -2.95748 1.61165 2.265517
H  -1.040665 2.840548 1.51618
H  -4.955119 0.591836 0.698144
H  -5.307627 -1.6222 -0.538869
H  -0.26155 1.144831 -0.754442
H  -0.137964 -1.370058 1.184812
H  -3.762529 -3.926223 -1.283939
H  0.328227 -3.621197 0.182776
H  -1.449175 -4.873907 -1.044781
H  3.983232 -0.036596 -1.666231
H  5.559829 -0.753015 -1.280619
H  5.337964 -0.360282 2.306096
H  6.307791 -0.966333 0.941591
H  1.923408 0.317581 -0.819125
H  3.320131 0.824966 1.90879
H  -2.086204 3.161855 -3.419384
H  -3.289572 3.841256 -2.250142
H  2.814812 -2.09765 -0.699422
H  4.438276 -2.834667 -0.388087
H  7.243947 1.146862 2.000625
H  5.761381 2.039733 1.461716
H  -3.28836 0.914048 -3.297767
H  -4.487464 1.627757 -2.173012
H  -4.396633 2.201588 -3.867824
