program: Gaussian 09
title: 000254884
version: EM64L-G09RevD.01
frameworkgroup: C1[X(C21H27NO)]
method: RPBEPBE
basis: SDD
operation: Freq
keyword: #p
keyword: freq=noraman
keyword: PBEPBE/SDD
title: #p freq=noraman PBEPBE/SDD
converged: YES YES NO NO
title: Mulliken charges:
elementType: O N C C C C C C C C C C C C C C C C C C C C C H H H H H H H H H H H H H H H H H H H H H H H H H H H
charge: -0.219673 -0.021261 -0.077537 -0.181211 0.192337 0.268635 0.229230 -0.275718 -0.520165 -0.576492 -0.470432 -0.596442 -0.542413 0.569165 -0.643380 -0.556307 -0.432969 -0.780990 -0.606824 0.162473 0.174800 -0.732052 -0.425664 0.228880 0.216276 0.240646 0.212782 0.231430 0.221440 0.218361 0.213390 0.231971 0.218129 0.218841 0.213278 0.214348 0.218744 0.237882 0.232443 0.231299 0.202937 0.207429 0.220311 0.206356 0.227777 0.262003 0.217370 0.228491 0.215901 0.274176
chargesum: 0.00000
title: Mulliken charges with hydrogens summed into heavy atoms:
elementType: O N C C C C C C C C C C C C C C C C C C C C C
charge: -0.219673 -0.021261 0.151342 0.035065 0.192337 0.268635 0.229230 -0.035072 -0.075953 -0.136691 -0.025071 -0.159472 -0.114787 0.569165 -0.186755 -0.092565 -0.022604 -0.126547 -0.344820 0.162473 0.174800 -0.070290 -0.151488
polarizability: 3.12301966e+02 -1.26782023e+01 2.28424964e+02 -6.78023638e+00 -3.30095093e+00 1.54379824e+02
1716.lowfreq: -8.9312 -3.8922 0.0001 0.0007 0.0009 5.7730 22.4186 44.5784 59.7090
frequency: 22.1883 44.5351 59.6178 80.2501 95.7797 110.1374 128.2687 136.3810 174.4116 195.6406 205.0334 215.4431 232.3925 246.1005 255.7530 266.8390 285.7708 312.5190 335.6697 340.1573 347.1508 366.5766 395.3930 418.0600 418.7190 447.0722 475.7760 504.4314 520.2708 535.9219 557.7547 585.3652 603.0525 613.7462 674.8988 675.9113 694.9633 718.2511 756.7804 770.3211 778.8544 787.2271 794.6678 831.9082 843.0403 852.4830 858.0666 865.5938 886.8096 905.1657 909.9888 931.6958 946.6858 959.8391 979.0060 980.6116 991.9980 1009.0483 1016.8309 1023.7742 1044.4674 1055.9716 1063.9887 1076.2560 1091.5452 1098.4931 1103.9347 1104.7880 1132.4450 1136.5914 1141.3232 1161.9135 1173.1728 1183.1272 1184.6576 1191.0413 1201.1188 1210.0763 1219.7396 1226.4990 1238.7147 1253.0826 1256.4151 1275.0256 1278.0087 1286.5176 1295.5544 1299.9445 1301.4770 1309.1820 1313.3708 1318.5623 1328.3941 1330.5128 1334.7977 1343.7676 1354.5597 1366.1700 1376.1845 1379.0052 1392.3504 1448.4138 1455.0809 1457.6939 1458.9598 1463.9601 1464.9586 1467.7929 1469.3115 1472.3526 1477.5689 1479.6956 1484.5033 1489.0584 1605.1697 1624.8106 1682.6647 2886.4480 2896.3443 2933.3571 2942.6310 2946.2040 2947.1482 2949.3068 2959.9818 2970.5213 2971.6466 2979.1100 2981.6046 2990.3786 2996.2848 3011.6681 3015.5439 3033.3611 3042.4622 3045.7748 3050.5144 3058.2916 3065.3975 3068.5258 3070.8794 3077.2001 3148.4799 3202.4450
redmass: 4.7403 3.3808 3.9091 2.7044 3.5115 2.4354 2.7804 2.9087 2.5465 3.1711 2.3970 1.1429 2.1962 2.4137 2.0460 2.4603 2.2365 3.1207 2.7742 2.7255 2.7007 2.2424 3.9276 3.8626 3.4732 3.2321 3.4366 3.1089 3.0524 3.2175 2.8524 6.2522 2.9781 4.1213 4.6538 3.0478 2.5795 4.4585 6.4022 4.4474 1.3207 2.5008 1.7653 2.1983 1.7872 1.7981 1.4981 1.5657 1.9791 1.8486 5.4218 2.3456 1.7893 1.9218 1.9314 1.8834 2.4528 2.0352 2.1894 1.9096 3.2112 1.9856 2.4142 2.5274 2.2033 1.7721 2.4590 2.0366 1.8616 1.4996 1.4571 1.3889 1.8176 1.6325 1.5164 2.2820 1.8837 1.4347 1.5894 1.4656 1.5571 1.8425 1.8671 1.4240 1.6783 1.2940 1.7005 1.3340 1.4038 1.5297 1.3789 1.4308 1.5251 1.6632 1.7951 1.7918 1.9142 1.9329 2.1540 1.2189 1.2058 1.1433 1.0877 1.1136 2.0077 1.4791 1.0874 1.0894 1.0981 1.0821 1.0624 1.0735 1.0561 1.0493 8.3423 7.4574 8.7323 1.0798 1.0792 1.0672 1.0743 1.0624 1.0765 1.0661 1.0586 1.0691 1.0358 1.0362 1.0610 1.0661 1.0913 1.1010 1.0895 1.0916 1.0957 1.1027 1.0931 1.1022 1.0992 1.0998 1.0992 1.0993 1.0923 1.0964
irintensity: 1.1594 0.2736 1.7060 0.2716 0.0423 0.3047 0.2746 0.1168 0.4854 1.0802 0.4042 0.1434 1.4311 0.3166 0.0488 1.3820 0.8412 0.8160 0.2271 1.3469 1.5553 0.2233 0.4159 0.8327 2.0811 2.8029 0.6694 3.3180 0.5437 0.4350 0.7980 3.6825 1.5322 11.5758 2.5726 1.1138 5.0660 0.7350 14.5161 4.4844 3.1006 2.5989 2.8758 0.8966 12.2501 13.4349 18.0661 9.7275 7.5680 4.0669 2.3424 5.3976 4.3447 15.7857 1.3620 2.4122 2.6039 9.3956 1.1595 3.0221 1.2351 4.2729 0.7008 0.4313 20.2880 0.9958 2.3925 10.2103 1.0104 6.9035 11.2258 1.4321 0.2558 0.1784 2.6953 9.9662 3.2760 5.6440 6.4186 0.5390 5.1908 4.5657 0.0770 4.1165 14.3774 4.9487 0.5934 2.0682 1.6857 9.2637 6.8100 2.6245 1.7499 0.6285 6.2645 3.8334 3.1005 0.5651 3.8839 18.0666 16.7312 18.1602 1.6289 4.8357 9.2947 19.0042 1.4126 17.5408 2.4556 4.0454 6.1768 2.7430 14.2601 3.7557 24.3411 36.9075 0.9670 19.2662 14.7900 26.7804 15.3095 28.5679 35.3562 52.8843 42.7531 35.8687 21.5475 35.0421 43.4103 34.0676 44.4240 18.1650 38.9442 44.6126 24.6873 51.2334 30.8501 26.0248 30.3442 68.7434 43.6194 52.1607 8.5543 2.4873
temp: 298.150 k
press: 1.00000 atm
elementType: 8 7 6 6 6 6 6 6 6 6 6 6 6 6 6 6 6 6 6 6 6 6 6 1 1 1 1 1 1 1 1 1 1 1 1 1 1 1 1 1 1 1 1 1 1 1 1 1 1 1
symmnumber: 1
zpe: 1128394.6 jmol-1
zpe.correction: 0.429783 hartree
zpe.thermalcorrener: 0.450435 hartree
zpe.thermalcorrenthalpy: 0.451379 hartree
zpe.thermalcorrgfe: 0.381046 hartree
zpe.sumelectzpe: -944.637479 hartree
zpe.sumelectthermal: -944.616827 hartree
zpe.sumelectthermalent: -944.615883 hartree
zpe.sumelectthermalfe: -944.686216 hartree
dipole: -5.7873 0.1113 1.1255
dipole: 5.8968
quadrupole: -185.8111 -128.1402 -138.8089
quadrupole: 1.3569 5.1804 -1.2044
quadrupole: -34.8910 22.7799 12.1111 1.3569 5.1804 -1.2044
hfenergy: -945.0672619 hartree
pointgroup: C01 [X(C21H27N1O1)]
dipole: -2.2837955 0.034886 0.4066983 debye
polarizability: 312.654751|-12.0900799|228.0827837|-4.061247|-4.9441249|154.3692193 unknown
InChI: InChI=1S/C21H27NO/c1-3-21(2)9-8-17-15-5-4-13-11-20-14(12-22-23-20)10-18(13)16(15)6-7-19(17)21/h11-12,15-16,18H,3-10H2,1-2H3
charge 0 multiplicity 1
50 atoms
O  5.734508 0.201816 -0.460124
N  6.214652 -1.182157 -0.220989
C  0.123428 -0.198583 0.239494
C  -0.708971 1.089969 0.507182
C  -2.183038 0.830221 0.245044
C  -4.265869 -0.366413 -0.010822
C  -2.739748 -0.412208 0.183149
C  1.627906 -0.019213 0.629532
C  -0.541718 -1.409885 0.942802
C  -1.954488 -1.691002 0.369681
C  -0.128537 2.271307 -0.3073
C  -3.244184 1.917765 0.112864
C  -4.48888 1.136414 -0.408774
C  2.21151 1.286204 0.048763
C  1.337552 2.526113 0.112678
C  2.431595 -1.316488 0.255713
C  -4.728667 -1.348718 -1.129644
C  -4.966802 -0.696979 1.340549
C  3.515777 1.380097 -0.369314
C  3.906493 -1.059309 0.084581
C  4.354414 0.208047 -0.263809
C  -6.231542 -1.281874 -1.481898
C  5.083242 -1.870194 0.089969
H  0.089929 -0.383494 -0.857703
H  -0.588067 1.35746 1.584981
H  1.665588 0.104085 1.738667
H  -0.618566 -1.19381 2.028682
H  0.076574 -2.319334 0.836128
H  -2.499897 -2.383755 1.042864
H  -1.86488 -2.226644 -0.599448
H  -0.720381 3.189582 -0.133418
H  -0.18783 2.041525 -1.38966
H  -3.43906 2.398095 1.09582
H  -2.954952 2.732047 -0.57823
H  -5.439736 1.538946 -0.016249
H  -4.52441 1.215175 -1.512456
H  1.324359 2.887436 1.165503
H  1.78826 3.335639 -0.490795
H  2.02399 -1.719707 -0.697106
H  2.253799 -2.092398 1.020734
H  -4.4759 -2.386106 -0.827504
H  -4.134643 -1.134043 -2.0417
H  -6.0654 -0.612512 1.254775
H  -4.733242 -1.726268 1.67396
H  -4.633747 -0.000069 2.13158
H  3.935497 2.324585 -0.730484
H  -6.868074 -1.577266 -0.628282
H  -6.528264 -0.261576 -1.787883
H  -6.465737 -1.963012 -2.320768
H  5.182054 -2.934809 0.305966
