program: Gaussian 09
title: 000254867
version: EM64L-G09RevD.01
frameworkgroup: C1[X(C14H13N3O2)]
method: RPBEPBE
basis: SDD
operation: Freq
keyword: #p
keyword: freq=noraman
keyword: PBEPBE/SDD
title: #p freq=noraman PBEPBE/SDD
converged: YES YES NO NO
title: Mulliken charges:
elementType: O O N N N C C C C C C C C C C C C C C H H H H H H H H H H H H H
charge: -0.204035 -0.204254 -0.019242 0.004737 0.020916 0.282789 0.352445 -0.617893 0.475828 -0.468769 -0.343431 -0.818007 -0.359369 -0.503757 0.380225 -0.375627 -0.331947 -0.358748 -0.181456 0.244530 0.234939 0.250073 0.237699 0.234067 0.249754 0.240163 0.229214 0.288137 0.286395 0.243028 0.289331 0.242267
chargesum: 0.00000
title: Mulliken charges with hydrogens summed into heavy atoms:
elementType: O O N N N C C C C C C C C C C C C C C
charge: -0.204035 -0.204254 -0.019242 0.004737 0.020916 0.282789 0.352445 -0.138424 0.475828 -0.218696 -0.105733 -0.094022 -0.130155 -0.215620 0.380225 -0.089233 -0.088919 -0.069417 0.060811
polarizability: 2.41428618e+02 6.09541103e+00 1.93475090e+02 -7.30315401e+00 1.98831491e+00 1.21220075e+02
1716.lowfreq: -7.5257 -4.8075 -0.0009 -0.0009 -0.0009 1.0587 18.0497 32.4444 39.2788
frequency: 17.8460 32.3964 39.2110 54.5278 92.6411 95.4488 101.7611 159.6526 163.4303 184.9733 222.7191 244.8741 278.4837 299.3254 341.2680 375.2871 386.8728 411.8164 424.6250 456.2692 504.7668 524.4172 524.8711 552.4735 621.3169 655.6500 685.8041 691.0143 702.7693 737.2412 759.3468 787.9286 823.4727 828.1825 850.3046 895.8325 898.7905 925.2339 941.5259 949.3098 967.4551 968.4496 984.5991 988.0205 1009.5968 1017.0282 1043.4756 1055.2532 1080.4217 1087.9762 1160.1384 1169.0739 1190.3422 1209.4732 1219.2770 1235.0892 1247.0823 1289.3175 1296.3605 1308.6052 1324.4208 1358.2373 1372.7662 1398.7122 1402.4482 1407.8215 1431.3244 1442.7767 1465.5024 1470.1282 1474.6941 1475.5628 1553.5801 1581.1947 1582.3972 1611.4435 1629.5388 2967.7554 2979.2923 2984.4796 3026.0672 3058.7285 3092.5898 3111.1478 3128.5826 3149.6751 3152.4646 3160.4665 3169.0093 3186.5554
redmass: 4.9286 5.2377 6.3049 9.3477 2.7123 1.3495 4.4150 3.6482 4.8638 4.4010 7.2619 4.2975 2.6572 2.3673 6.7227 3.1835 3.5717 6.2308 3.1870 3.6127 4.3876 6.3229 4.3666 5.6555 6.2243 7.4392 2.5458 7.0362 4.4686 4.0125 3.5691 5.4955 2.3786 1.4988 1.8440 1.8498 3.1990 1.6332 1.6800 3.6553 1.3789 1.4705 1.7171 6.2313 1.4888 1.4539 1.6061 1.9888 1.7387 1.6533 3.2047 1.1427 1.9164 4.2203 1.2141 3.2714 2.3961 1.4766 2.1577 1.4337 2.0837 1.7284 8.9577 1.2415 1.9490 3.6559 2.3254 1.2819 1.1902 1.8339 1.1042 2.7686 5.8958 6.7323 5.9980 6.6654 6.6954 1.0862 1.0388 1.0609 1.1003 1.0954 1.0995 1.0911 1.0878 1.0880 1.0980 1.0921 1.0945 1.0967
irintensity: 0.9358 0.7051 1.0175 0.4534 0.8649 0.3796 0.8690 1.4688 12.9067 5.1154 1.8257 1.0988 3.9052 0.3464 0.3908 0.3554 1.2229 2.6530 0.3049 12.3153 7.6591 0.2181 6.8440 1.5988 3.3034 12.0063 17.2191 19.9679 25.2426 0.8743 3.9800 16.6175 20.5830 36.8399 11.7545 0.9943 14.2505 6.0854 9.8811 5.5791 2.2680 0.0879 1.7744 0.2779 9.3874 12.1226 11.5789 6.6036 21.0354 31.2094 2.3138 25.3760 5.4636 201.2017 3.9076 83.2067 1.5059 1.5731 6.3669 32.1365 1.5299 0.2424 110.9499 15.3200 11.2582 1.8118 30.6913 24.4526 17.1506 17.3509 9.8145 20.6622 10.0017 3.5948 26.2851 13.2938 37.7071 27.9300 15.8431 21.7393 8.7634 11.8276 16.6913 22.2524 5.6268 6.3613 29.5112 2.0058 7.1971 3.6376
temp: 298.150 k
press: 1.00000 atm
elementType: 8 8 7 7 7 6 6 6 6 6 6 6 6 6 6 6 6 6 6 1 1 1 1 1 1 1 1 1 1 1 1 1
symmnumber: 1
zpe: 639524.1 jmol-1
zpe.correction: 0.243582 hartree
zpe.thermalcorrener: 0.260460 hartree
zpe.thermalcorrenthalpy: 0.261405 hartree
zpe.thermalcorrgfe: 0.196233 hartree
zpe.sumelectzpe: -854.543746 hartree
zpe.sumelectthermal: -854.526867 hartree
zpe.sumelectthermalent: -854.525923 hartree
zpe.sumelectthermalfe: -854.591094 hartree
dipole: 2.5825 -4.3705 2.4832
dipole: 5.6513
quadrupole: -125.7599 -113.5886 -110.3574
quadrupole: 14.6706 12.1113 4.6891
quadrupole: -9.1912 2.9800 6.2112 14.6706 12.1113 4.6891
hfenergy: -854.7873279 hartree
pointgroup: C01 [X(C14H13N3O2)]
dipole: 0.9407497 0.7437848 -1.8722276 debye
polarizability: 236.5435312|18.1203522|163.8900038|19.2848198|-32.7936726|155.6902476 unknown
InChI: InChI=1S/C14H13N3O2/c1-11-5-6-15-9-13(11)10-16-8-12-3-2-4-14(7-12)17(18)19/h2-9H,10H2,1H3
charge 0 multiplicity 1
32 atoms
O  -5.011953 -2.332204 0.879016
O  -2.966165 -2.715127 1.810851
N  0.743489 1.626623 -1.021574
N  4.060521 0.829442 2.277239
N  -3.753575 -2.076372 1.011359
C  3.040189 1.095036 0.04768
C  3.565706 -0.165499 -0.372628
C  2.188092 1.961726 -0.866488
C  -1.248225 0.361384 -0.450176
C  3.318656 1.528049 1.368449
C  4.336968 -0.895048 0.565856
C  3.332055 -0.700889 -1.772262
C  0.193072 0.681058 -0.311466
C  -1.804382 -0.680561 0.329743
C  -3.175258 -0.979818 0.191771
C  -2.083381 1.080149 -1.352057
C  4.557613 -0.372135 1.860142
C  -4.016071 -0.275991 -0.696343
C  -3.451383 0.762562 -1.470401
H  2.215307 3.013661 -0.519742
H  2.603287 1.976639 -1.892849
H  2.927463 2.492051 1.719493
H  4.765323 -1.865477 0.292034
H  3.690411 -1.739618 -1.866257
H  2.261766 -0.679865 -2.045515
H  3.868163 -0.092498 -2.526106
H  0.751479 0.070216 0.427986
H  -1.197227 -1.256022 1.035908
H  -1.628369 1.880821 -1.943734
H  5.151644 -0.926059 2.595888
H  -5.073112 -0.545737 -0.765734
H  -4.085006 1.322107 -2.165879
