program: Gaussian 09
title: 000254857
version: EM64L-G09RevD.01
frameworkgroup: C1[X(C14H11NO3)]
method: RPBEPBE
basis: SDD
operation: Freq
keyword: #p
keyword: freq=noraman
keyword: PBEPBE/SDD
title: #p freq=noraman PBEPBE/SDD
converged: YES YES NO NO
title: Mulliken charges:
elementType: O O O N C C C C C C C C C C C C C C H H H H H H H H H H H
charge: -0.334444 -0.204302 -0.247503 -0.682025 0.308642 -0.341109 -0.316061 0.501360 -0.406205 -0.402237 0.323239 0.121048 0.095082 -0.347205 -0.258067 -0.153807 -0.165307 -0.214990 0.264168 0.263103 0.221948 0.220255 0.243046 0.238003 0.216872 0.213843 0.218355 0.312285 0.312011
chargesum: 0.00000
title: Mulliken charges with hydrogens summed into heavy atoms:
elementType: O O O N C C C C C C C C C C C C C C
charge: -0.334444 -0.204302 -0.247503 -0.057729 0.308642 -0.076940 -0.052958 0.501360 -0.184257 -0.181981 0.323239 0.121048 0.095082 -0.104159 -0.020064 0.063066 0.048536 0.003364
polarizability: 3.33813068e+02 -9.51063441e+00 1.39365058e+02 -1.48949716e+01 -8.25577237e-01 1.13367606e+02
1716.lowfreq: -8.8064 -3.8761 -2.1663 -0.0003 0.0005 0.0008 21.5023 37.3528 44.9532
frequency: 21.4785 37.3008 44.9331 74.5180 99.2812 134.7177 156.7366 193.9200 243.8801 266.5018 344.7937 350.3241 360.3200 369.0694 383.4371 409.0839 418.2475 419.7736 420.8097 475.2349 499.7786 509.9050 591.1227 599.1836 624.7661 636.1853 659.6727 691.3821 729.5121 747.4893 752.0828 770.1994 819.0777 822.2387 841.9281 863.6416 869.2312 918.7070 943.2441 955.3754 970.5469 979.4919 1000.0000 1002.7407 1019.0486 1021.0914 1037.8948 1133.3419 1142.0333 1182.6632 1210.7191 1241.4258 1269.5110 1280.3680 1309.8554 1328.7698 1378.8552 1392.6869 1397.6504 1451.5333 1456.8399 1508.0391 1518.3416 1552.0282 1571.7153 1603.9864 1614.5037 1631.7296 1644.5705 1668.7736 3099.3742 3111.0224 3125.2201 3126.2213 3128.0810 3132.8576 3145.0090 3159.3952 3178.4477 3559.0950 3698.9552
redmass: 6.2529 3.8548 5.6442 6.2361 5.5971 6.8562 6.8475 5.2946 6.0742 5.2652 3.7623 6.9475 7.1216 3.2972 6.2460 1.6893 1.5887 3.0900 1.3359 6.3747 3.6566 4.6994 3.6671 4.5564 6.1543 6.0153 4.0348 4.3666 3.8421 4.5829 3.6467 1.8099 5.3300 1.2716 1.8264 4.9633 1.6889 7.3974 1.3986 3.2456 1.3762 1.3563 1.3438 2.6369 1.3379 1.4466 3.0664 1.2076 3.3707 1.2020 1.6102 2.2556 1.4566 1.2419 1.3145 3.0394 1.7744 4.4092 1.5746 4.4016 2.3135 4.8353 3.1839 9.4192 7.0318 5.4792 6.3436 4.0427 1.3517 9.8012 1.0838 1.0856 1.0893 1.0898 1.0896 1.0923 1.0963 1.0957 1.0947 1.0451 1.1040
irintensity: 5.1920 0.6645 4.5466 1.2503 0.0533 0.4724 0.7047 1.0913 4.6245 8.8363 1.0166 4.4398 6.2148 9.4707 3.8104 0.1174 4.7970 22.3861 290.7808 4.5755 3.2732 3.8248 5.9462 31.0712 10.9927 7.1379 49.4010 34.5638 18.3857 38.6918 20.6899 52.7662 22.3579 0.3196 78.9603 10.2595 0.8567 507.8814 7.5787 158.7167 0.1014 0.0924 0.2251 20.3842 0.6458 17.8617 111.1570 14.2828 653.1853 95.3729 40.8781 202.3371 0.3211 16.2225 1.3787 121.0168 10.9995 8.5266 12.2998 4.4097 33.4660 247.9349 45.5232 41.1669 20.5965 34.9070 56.8699 283.4292 503.8588 176.6802 8.2809 2.8281 13.9786 11.8477 26.8194 26.3956 27.7443 10.2391 3.3691 134.1626 23.9549
temp: 298.150 k
press: 1.00000 atm
elementType: 8 8 8 7 6 6 6 6 6 6 6 6 6 6 6 6 6 6 1 1 1 1 1 1 1 1 1 1 1
symmnumber: 1
zpe: 568546.3 jmol-1
zpe.correction: 0.216548 hartree
zpe.thermalcorrener: 0.232106 hartree
zpe.thermalcorrenthalpy: 0.233050 hartree
zpe.thermalcorrgfe: 0.172190 hartree
zpe.sumelectzpe: -819.235425 hartree
zpe.sumelectthermal: -819.219867 hartree
zpe.sumelectthermalent: -819.218922 hartree
zpe.sumelectthermalfe: -819.279783 hartree
dipole: 1.6916 3.3746 -1.3939
dipole: 4.0240
quadrupole: -40.4877 -102.0791 -106.9073
quadrupole: -2.4288 -4.0358 -1.3474
quadrupole: 42.6704 -18.9211 -23.7493 -2.4288 -4.0358 -1.3474
hfenergy: -819.4519726 hartree
pointgroup: C01 [X(C14H11N1O3)]
dipole: -0.6838379 0.267464 -1.4025644 debye
polarizability: 332.2607307|-23.3871385|115.5090745|-9.5268229|5.3968165|138.7759269 unknown
InChI: InChI=1S/C14H11NO3/c15-11-8-6-10(7-9-11)14(17)18-13-5-3-1-2-4-12(13)16/h1-9H,15H2
charge 0 multiplicity 1
29 atoms
O  0.393821 -0.674191 -0.623855
O  -0.054482 -1.594276 1.499687
O  1.05219 1.157152 1.232523
N  -5.869384 0.709689 -0.370112
C  -1.856162 -0.509845 0.254752
C  -2.877453 -0.878495 1.175073
C  -2.20388 0.278235 -0.876301
C  -4.554927 0.310005 -0.164803
C  -4.204261 -0.479659 0.974129
C  -3.528868 0.68246 -1.087056
C  1.754725 -0.450564 -0.394443
C  -0.482464 -0.948692 0.525061
C  2.039828 0.581502 0.651355
C  2.615754 -1.12924 -1.249432
C  3.412525 0.948694 1.009047
C  4.042942 -1.074666 -1.352024
C  4.640819 0.564649 0.487039
C  4.944725 -0.339928 -0.586018
H  -2.601927 -1.477706 2.049414
H  -1.419002 0.573658 -1.577534
H  -4.980532 -0.769572 1.692394
H  -3.78395 1.294147 -1.960823
H  2.106634 -1.81269 -1.941306
H  3.425624 1.683158 1.825967
H  4.473437 -1.718466 -2.130237
H  5.516027 1.030978 0.960678
H  6.009237 -0.4636 -0.822815
H  -6.600121 0.459748 0.290364
H  -6.121777 1.281315 -1.171528
